program: Orca
programVersion: 5.0.2
elementType: Cl O O N N N C C C C C C C C C C C C C C H H H H H H H H H H H H H H H H H H H
charge: 1
multiplicity: 1
keywords: wb97x-d3
keywords: def2-TZVPP
keywords: def2/J RIJCOSX
keywords: DEFGRID2
keywords: scfconv7
keywords: smallprint printgap noloewdin
keywords: NOSOSCF
formula: C14H19ClN3O2
InChI: InChI=1/C14H19ClN3O2/c1-14(2,3)12(19)13(18-9-16-8-17-18)20-11-6-4-10(15)5-7-11/h4-9,12-13,17,19H,1-3H3
39 atoms
Cl -5.568408 0.968528 0.335103
O  2.537844 -0.878788 -1.81398
O  -0.091294 -0.713663 -0.90882
N  1.321309 0.696518 0.28765
N  1.883663 1.520013 -0.605387
N  1.594533 2.648093 1.236111
C  3.320494 -1.773444 0.29674
C  2.110699 -1.496936 -0.619445
C  0.961198 -0.694603 0.005429
C  4.16357 -0.535769 0.613558
C  2.833844 -2.403874 1.602864
C  4.20596 -2.791777 -0.430226
C  1.149836 1.413343 1.390131
C  -1.344631 -0.304225 -0.53348
C  2.052038 2.681099 -0.007828
C  -2.18772 0.064202 -1.574922
C  -1.801338 -0.275186 0.776812
C  -3.489608 0.451352 -1.312492
C  -3.10559 0.121143 1.040103
C  -3.941686 0.480514 -0.001451
H  1.658265 -2.473923 -0.832565
H  0.694799 -1.119997 0.972752
H  3.656218 0.175336 1.266603
H  5.063858 -0.847323 1.14638
H  4.493288 -0.011188 -0.283967
H  2.169311 -3.25154 1.420354
H  2.308286 -1.693252 2.243549
H  3.685985 -2.77379 2.17491
H  4.638397 -2.386286 -1.344986
H  3.646924 -3.692802 -0.692143
H  5.032606 -3.093059 0.214833
H  1.931664 -1.110104 -2.526845
H  0.704428 1.001661 2.28222
H  2.505987 3.525387 -0.500908
H  -1.826399 0.041122 -2.594821
H  -1.183952 -0.568306 1.614889
H  -4.141014 0.732344 -2.128624
H  -3.457207 0.140358 2.062495
H  2.20107 1.171014 -1.509863
elementType: Cl O N C H
totalener: -1319.76465455 hartree
nucrepener: 1755.44356793 hartree
electener: -3075.20822248 hartree
oneelecener: -5268.56737180 hartree
twoeener: 2193.35914933 hartree
cpcmener: -0.12044847 hartree
kineticenergy: 1315.23969362 hartree
xcener: -104.288046227244 hartree
chargesum: 1.0000000
charge: -0.098914 -0.422589 -0.305010 0.079005 -0.027530 -0.356651 0.260100 0.115283 0.056015 -0.381747 -0.369819 -0.336823 0.187429 0.309824 0.207919 -0.255064 -0.207438 -0.109022 -0.160419 0.078711 0.126586 0.178322 0.099729 0.111071 0.110291 0.113485 0.096172 0.105783 0.096502 0.101129 0.098291 0.244211 0.200337 0.203199 0.148387 0.148983 0.147582 0.146523 0.260153
qa: -0.0989 -0.4226 -0.3050 0.0790 -0.0275 -0.3567 0.2601 0.1153 0.0560 -0.3817 -0.3698 -0.3368 0.1874 0.3098 0.2079 -0.2551 -0.2074 -0.1090 -0.1604 0.0787 0.1266 0.1783 0.0997 0.1111 0.1103 0.1135 0.0962 0.1058 0.0965 0.1011 0.0983 0.2442 0.2003 0.2032 0.1484 0.1490 0.1476 0.1465 0.2602
va: 1.2039 2.0146 2.0906 3.3162 3.4825 3.0493 3.6541 3.9456 4.0336 3.9608 3.9509 3.9195 3.9763 3.6911 3.9450 4.0325 3.9279 3.9604 4.0046 3.8313 1.0046 0.9570 0.9971 1.0063 1.0097 1.0026 0.9999 1.0054 1.0151 1.0034 1.0057 0.9958 0.9802 0.9737 1.0066 1.0021 1.0017 1.0053 0.9912
dispersion: -0.021423015 hartree
energy: -1319.786077561468 hartree
dipole: 39.10889 -35.67290 3.43599 -16.51675 16.74306 0.22631 2.36193 -2.83583 -0.47390
magnitude: 3.47589 au
magnitude: 8.83500 debye
