program: Orca
programVersion: 5.0.2
elementType: Cl O O N N N C C C C C C C C C C C C C C H H H H H H H H H H H H H H H H H H H
charge: 1
multiplicity: 1
keywords: wb97x-d3
keywords: def2-TZVPP
keywords: def2/J RIJCOSX
keywords: DEFGRID2
keywords: scfconv7
keywords: smallprint printgap noloewdin
keywords: NOSOSCF
formula: C14H19ClN3O2
InChI: InChI=1/C14H19ClN3O2/c1-14(2,3)12(19)13(18-9-16-8-17-18)20-11-6-4-10(15)5-7-11/h4-9,12-13,16,19H,1-3H3
39 atoms
Cl -5.712037 0.091936 0.078357
O  2.817299 -0.260303 -1.533705
O  0.005641 -0.648417 -0.970162
N  1.187503 1.055081 0.053728
N  1.21693 1.683281 1.236435
N  1.434959 3.101747 -0.397438
C  3.293837 -1.515325 0.54074
C  2.279657 -1.109514 -0.549724
C  1.000296 -0.414586 -0.049944
C  3.791272 -0.331164 1.367914
C  2.653936 -2.562645 1.456327
C  4.489916 -2.165789 -0.165164
C  1.311959 1.896579 -0.946435
C  -1.31466 -0.438424 -0.64061
C  1.375323 2.932737 0.953669
C  -1.755813 0.071844 0.57077
C  -2.226414 -0.783584 -1.62936
C  -3.119095 0.230818 0.788718
C  -3.580097 -0.621201 -1.408642
C  -4.027223 -0.111761 -0.196172
H  1.91329 -2.042921 -1.00052
H  0.743343 -0.736279 0.962815
H  4.609854 -0.649389 2.01407
H  4.176708 0.473775 0.739712
H  3.021703 0.075831 2.024833
H  3.384457 -2.927464 2.178118
H  2.294824 -3.428244 0.896306
H  1.817148 -2.171289 2.038362
H  5.167076 -2.599907 0.569824
H  5.080597 -1.44883 -0.738258
H  4.184279 -2.97741 -0.830329
H  3.428614 -0.756142 -2.084666
H  1.301372 1.662984 -1.997203
H  1.443207 3.731832 1.673079
H  -1.084782 0.347608 1.37332
H  -1.873585 -1.19088 -2.567611
H  -3.466394 0.621719 1.734828
H  -4.288994 -0.897278 -2.176598
H  1.542221 3.972314 -0.899253
totalener: -1319.67944302 hartree
nucrepener: 1748.59556003 hartree
electener: -3068.27500305 hartree
oneelecener: -5257.66715139 hartree
twoeener: 2189.39214834 hartree
kineticenergy: 1315.30987110 hartree
xcener: -104.296940751516 hartree
chargesum: 1.0000000
charge: -0.033633 -0.363745 -0.280354 0.135657 -0.265769 -0.117270 0.199750 0.088900 0.049672 -0.352006 -0.323047 -0.344293 0.185525 0.296275 0.159150 -0.188784 -0.248504 -0.161388 -0.066058 0.049292 0.129901 0.171616 0.117667 0.096668 0.096123 0.108721 0.111711 0.093679 0.105691 0.094159 0.117924 0.196305 0.212024 0.193359 0.119537 0.135790 0.133432 0.137681 0.208639
qa: -0.0336 -0.3637 -0.2804 0.1357 -0.2658 -0.1173 0.1998 0.0889 0.0497 -0.3520 -0.3230 -0.3443 0.1855 0.2963 0.1591 -0.1888 -0.2485 -0.1614 -0.0661 0.0493 0.1299 0.1716 0.1177 0.0967 0.0961 0.1087 0.1117 0.0937 0.1057 0.0942 0.1179 0.1963 0.2120 0.1934 0.1195 0.1358 0.1334 0.1377 0.2086
va: 1.2705 2.0453 2.1016 3.3810 2.8573 3.5500 3.6561 3.9232 3.9437 3.9199 3.9418 3.9208 3.9469 3.7029 3.9042 3.9282 4.0664 4.0787 3.9650 4.0284 1.0148 0.9841 1.0135 1.0146 1.0032 1.0068 1.0054 1.0076 1.0126 1.0083 0.9991 1.0447 0.9930 0.9785 1.0208 1.0125 1.0123 1.0064 0.9918
dispersion: -0.020531391 hartree
energy: -1319.699974412763 hartree
dipole: 40.16183 -36.89671 3.26512 -10.38931 13.01358 2.62427 4.63057 -5.28933 -0.65877
magnitude: 4.24049 au
magnitude: 10.77847 debye
