program: Orca
programVersion: 5.0.2
elementType: Cl O O N N N C C C C C C C C C C C C C C H H H H H H H H H H H H H H H H H H H
charge: 1
multiplicity: 1
keywords: wb97x-d3
keywords: def2-TZVPP
keywords: def2/J RIJCOSX
keywords: DEFGRID2
keywords: scfconv7
keywords: smallprint printgap noloewdin
keywords: NOSOSCF
formula: C14H19ClN3O2
InChI: InChI=1/C14H19ClN3O2/c1-14(2,3)12(19)13(18-9-16-8-17-18)20-11-6-4-10(15)5-7-11/h4-9,12-13,16,19H,1-3H3
39 atoms
Cl -5.449908 -0.545078 0.655682
O  3.565021 0.458164 -0.278237
O  0.218523 -0.413627 -0.820296
N  1.263449 1.571252 -0.264568
N  1.605958 2.421348 0.706304
N  1.436738 3.453376 -1.20093
C  2.870854 -1.817588 0.381487
C  2.566394 -0.514529 -0.390797
C  1.194149 0.109827 -0.012651
C  1.697548 -2.795339 0.276964
C  4.103757 -2.463936 -0.259223
C  3.157281 -1.541016 1.861836
C  1.164398 2.169683 -1.425743
C  -1.098208 -0.396708 -0.409259
C  1.707213 3.572585 0.127493
C  -1.582988 0.409625 0.608597
C  -1.948569 -1.246846 -1.10077
C  -2.931196 0.35615 0.93745
C  -3.290846 -1.291642 -0.774576
C  -3.781861 -0.488574 0.24681
H  2.491741 -0.764166 -1.456924
H  0.97609 0.023857 1.057097
H  1.987795 -3.755258 0.704209
H  0.811931 -2.46761 0.824078
H  1.40805 -2.97742 -0.758609
H  4.367383 -3.378681 0.272111
H  4.977048 -1.811906 -0.240174
H  3.914859 -2.734791 -1.299383
H  3.309648 -2.484131 2.386146
H  2.338367 -1.031075 2.373784
H  4.071527 -0.965137 2.031042
H  3.985868 0.400875 0.584705
H  0.908065 1.717851 -2.370029
H  1.959935 4.498382 0.617023
H  -0.951653 1.086323 1.1697
H  -1.558179 -1.877891 -1.88819
H  -3.313131 0.978754 1.734174
H  -3.954127 -1.957161 -1.30907
H  1.434539 4.191177 -1.891686
totalener: -1319.67660401 hartree
nucrepener: 1745.88440072 hartree
electener: -3065.56100473 hartree
oneelecener: -5252.16854861 hartree
twoeener: 2186.60754388 hartree
kineticenergy: 1315.30880614 hartree
xcener: -104.292931977505 hartree
chargesum: 1.0000000
charge: -0.030430 -0.363181 -0.286932 0.160120 -0.251306 -0.118269 0.097649 0.143173 -0.006532 -0.294340 -0.279577 -0.320493 0.168568 0.269836 0.146876 -0.170871 -0.214192 -0.159009 -0.070368 0.053300 0.104077 0.164599 0.111457 0.081846 0.103323 0.105890 0.099685 0.098286 0.114734 0.100871 0.087988 0.208075 0.216057 0.194368 0.116881 0.135770 0.134361 0.138426 0.209287
qa: -0.0304 -0.3632 -0.2869 0.1601 -0.2513 -0.1183 0.0976 0.1432 -0.0065 -0.2943 -0.2796 -0.3205 0.1686 0.2698 0.1469 -0.1709 -0.2142 -0.1590 -0.0704 0.0533 0.1041 0.1646 0.1115 0.0818 0.1033 0.1059 0.0997 0.0983 0.1147 0.1009 0.0880 0.2081 0.2161 0.1944 0.1169 0.1358 0.1344 0.1384 0.2093
va: 1.2736 2.0774 2.0499 3.4252 2.8852 3.5557 3.9525 3.8979 3.9846 3.9322 3.9266 3.9442 3.9496 3.6936 3.9327 3.9397 4.0578 4.0715 3.9730 4.0220 1.0143 0.9806 1.0101 1.0054 1.0114 1.0081 1.0164 1.0055 1.0070 1.0052 1.0139 1.0449 0.9763 0.9780 1.0172 1.0112 1.0115 1.0064 0.9918
dispersion: -0.020755044 hartree
energy: -1319.697359058388 hartree
dipole: 34.58957 -32.01017 2.57939 -11.76458 15.01710 3.25252 1.57110 -2.80632 -1.23522
magnitude: 4.33104 au
magnitude: 11.00863 debye
