program: Orca
programVersion: 5.0.2
elementType: Cl O O N N N C C C C C C C C C C C C C C H H H H H H H H H H H H H H H H H H H
charge: 1
multiplicity: 1
keywords: wb97x-d3
keywords: def2-TZVPP
keywords: def2/J RIJCOSX
keywords: DEFGRID2
keywords: scfconv7
keywords: smallprint printgap noloewdin
keywords: NOSOSCF
formula: C14H19ClN3O2
InChI: InChI=1/C14H19ClN3O2/c1-14(2,3)12(19)13(18-9-16-8-17-18)20-11-6-4-10(15)5-7-11/h4-9,12-13,16,19H,1-3H3
39 atoms
Cl -5.696108 -0.000333 0.239643
O  2.568243 -0.626683 -1.761112
O  0.012292 -0.738142 -0.857609
N  1.196313 0.955268 0.194792
N  1.178992 1.54364 1.398421
N  1.516413 3.008982 -0.172691
C  3.544693 -1.150363 0.390556
C  2.284923 -1.179281 -0.500821
C  1.01725 -0.509778 0.05359
C  4.521172 -2.175046 -0.200458
C  4.242929 0.212737 0.420059
C  3.187002 -1.580883 1.8147
C  1.396681 1.824665 -0.76836
C  -1.306359 -0.534726 -0.516276
C  1.378969 2.798473 1.165615
C  -2.22104 -0.792441 -1.528004
C  -1.741536 -0.109268 0.728972
C  -3.572902 -0.629173 -1.295977
C  -3.102426 0.05152 0.958097
C  -4.014429 -0.20466 -0.04953
H  1.994399 -2.235991 -0.585299
H  0.788163 -0.864538 1.061292
H  4.092292 -3.179055 -0.211235
H  4.814828 -1.920345 -1.218161
H  5.42923 -2.219321 0.400879
H  4.450159 0.593042 -0.579966
H  5.204647 0.110514 0.92391
H  3.694195 0.966956 0.985284
H  2.640341 -2.526689 1.832571
H  2.596019 -0.835386 2.350719
H  4.095742 -1.731475 2.397086
H  2.131028 -1.138948 -2.445868
H  1.456503 1.621436 -1.823553
H  1.424871 3.573324 1.912997
H  -1.875326 -1.133017 -2.49505
H  -1.067102 0.09688 1.549089
H  -4.284102 -0.836984 -2.082904
H  -3.444632 0.3754 1.93094
H  1.67536 3.892269 -0.637553
totalener: -1319.67945249 hartree
nucrepener: 1753.36660319 hartree
electener: -3073.04605568 hartree
oneelecener: -5266.97090383 hartree
twoeener: 2193.92484815 hartree
kineticenergy: 1315.31130219 hartree
xcener: -104.296897998996 hartree
chargesum: 1.0000000
charge: -0.032264 -0.363096 -0.283284 0.141908 -0.256579 -0.107555 0.183703 0.114493 0.011319 -0.309100 -0.347677 -0.333678 0.180150 0.300964 0.152796 -0.248678 -0.191513 -0.067694 -0.156445 0.048603 0.119866 0.169921 0.096380 0.111667 0.101878 0.120054 0.118551 0.073243 0.113957 0.084042 0.114277 0.207980 0.207919 0.192069 0.128675 0.121522 0.137585 0.133855 0.210184
qa: -0.0323 -0.3631 -0.2833 0.1419 -0.2566 -0.1076 0.1837 0.1145 0.0113 -0.3091 -0.3477 -0.3337 0.1802 0.3010 0.1528 -0.2487 -0.1915 -0.0677 -0.1564 0.0486 0.1199 0.1699 0.0964 0.1117 0.1019 0.1201 0.1186 0.0732 0.1140 0.0840 0.1143 0.2080 0.2079 0.1921 0.1287 0.1215 0.1376 0.1339 0.2102
va: 1.2720 2.0710 2.0968 3.3520 2.8375 3.5489 3.7330 3.9477 4.0405 3.9249 3.9249 3.9494 3.9276 3.6929 3.9084 4.0753 3.9396 3.9723 4.0719 4.0281 0.9996 0.9738 1.0060 1.0111 1.0089 1.0119 1.0163 1.0010 1.0048 1.0046 1.0104 1.0297 1.0036 0.9799 1.0145 1.0205 1.0066 1.0117 0.9910
dispersion: -0.021118417 hartree
energy: -1319.700570908373 hartree
dipole: 41.45222 -38.64256 2.80966 -6.92812 9.58460 2.65648 2.82989 -3.34117 -0.51129
magnitude: 3.90032 au
magnitude: 9.91383 debye
