program: Orca
programVersion: 5.0.2
elementType: Cl O O N N N C C C C C C C C C C C C C C H H H H H H H H H H H H H H H H H H H
charge: 1
multiplicity: 1
keywords: wb97x-d3
keywords: def2-TZVPP
keywords: def2/J RIJCOSX
keywords: DEFGRID2
keywords: scfconv7
keywords: smallprint printgap noloewdin
keywords: NOSOSCF
formula: C14H19ClN3O2
InChI: InChI=1/C14H19ClN3O2/c1-14(2,3)12(19)13(18-9-16-8-17-18)20-11-6-4-10(15)5-7-11/h4-9,12-13,16,19H,1-3H3
39 atoms
Cl -5.698382 -0.129877 0.279065
O  2.641413 -0.57428 -1.749286
O  0.02197 -0.672035 -0.867109
N  1.223842 1.023398 0.16441
N  1.274617 1.613532 1.370231
N  1.492509 3.077256 -0.220294
C  3.533916 -1.184705 0.403503
C  2.292089 -1.136498 -0.511478
C  1.043468 -0.429355 0.043655
C  4.505294 -2.191216 -0.225483
C  4.256099 0.158331 0.539177
C  3.142881 -1.698545 1.79023
C  1.350929 1.899207 -0.809297
C  -1.287809 -0.507149 -0.517675
C  1.444199 2.870547 1.118933
C  -2.207625 -0.894415 -1.486558
C  -1.727854 0.002611 0.695961
C  -3.563474 -0.780737 -1.243793
C  -3.091603 0.115947 0.937511
C  -4.000823 -0.274607 -0.027723
H  1.96131 -2.177645 -0.629041
H  0.805203 -0.784963 1.04794
H  4.044337 -3.174164 -0.343133
H  4.858812 -1.868473 -1.204888
H  5.381825 -2.315178 0.411852
H  4.500743 0.604437 -0.42576
H  5.200482 0.004926 1.065512
H  3.698367 0.888829 1.124901
H  2.574346 -2.630148 1.733833
H  2.552614 -0.977469 2.359273
H  4.039631 -1.902482 2.377782
H  2.101155 -0.96181 -2.445877
H  1.325636 1.713491 -1.869649
H  1.530747 3.651646 1.855722
H  -1.859741 -1.291375 -2.431891
H  -1.050665 0.315165 1.478955
H  -4.271462 -1.088384 -2.00163
H  -3.428958 0.511357 1.886145
H  1.597406 3.967362 -0.695488
elementType: Cl O N C H
totalener: -1319.77825083 hartree
nucrepener: 1749.05468305 hartree
electener: -3068.83293388 hartree
oneelecener: -5257.82721844 hartree
twoeener: 2188.99428455 hartree
cpcmener: -0.10433791 hartree
kineticenergy: 1315.25312237 hartree
xcener: -104.287616199465 hartree
chargesum: 1.0000000
charge: -0.093633 -0.413201 -0.304389 0.119666 -0.300164 -0.081871 0.219073 0.158713 0.064282 -0.339850 -0.364327 -0.356260 0.204830 0.332778 0.171034 -0.280642 -0.194358 -0.100605 -0.185143 0.074068 0.117747 0.173880 0.099338 0.097390 0.098205 0.105708 0.108925 0.097884 0.111226 0.090894 0.104509 0.234734 0.209875 0.200043 0.145172 0.139236 0.145781 0.144584 0.244869
qa: -0.0936 -0.4132 -0.3044 0.1197 -0.3002 -0.0819 0.2191 0.1587 0.0643 -0.3399 -0.3643 -0.3563 0.2048 0.3328 0.1710 -0.2806 -0.1944 -0.1006 -0.1851 0.0741 0.1177 0.1739 0.0993 0.0974 0.0982 0.1057 0.1089 0.0979 0.1112 0.0909 0.1045 0.2347 0.2099 0.2000 0.1452 0.1392 0.1458 0.1446 0.2449
va: 1.2093 2.0299 2.0865 3.3711 2.8486 3.5642 3.7058 3.9375 3.9765 3.9158 3.9367 3.9430 3.9093 3.6920 3.9061 4.0444 3.9279 3.9629 4.0489 3.8550 1.0025 0.9763 1.0039 1.0162 1.0061 1.0167 1.0066 1.0041 1.0032 1.0069 1.0053 1.0032 0.9929 0.9766 1.0085 1.0177 1.0026 1.0065 0.9666
dispersion: -0.020974237 hartree
energy: -1319.799225069464 hartree
dipole: 41.03551 -37.87093 3.16458 -6.82214 10.40870 3.58656 2.78197 -3.60417 -0.82220
magnitude: 4.85324 au
magnitude: 12.33597 debye
