program: Orca
programVersion: 5.0.2
elementType: Cl O O N N N C C C C C C C C C C C C C C H H H H H H H H H H H H H H H H H H H
charge: 1
multiplicity: 1
keywords: wb97x-d3
keywords: def2-TZVPP
keywords: def2/J RIJCOSX
keywords: DEFGRID2
keywords: scfconv7
keywords: smallprint printgap noloewdin
keywords: NOSOSCF
formula: C14H19ClN3O2
InChI: InChI=1/C14H19ClN3O2/c1-14(2,3)12(19)13(18-9-16-8-17-18)20-11-6-4-10(15)5-7-11/h4-9,12-13,16,19H,1-3H3
39 atoms
Cl 5.541471 0.232809 0.474819
O  -3.025635 -0.203955 -1.450096
O  -0.092139 0.40561 -1.130403
N  -1.17908 -1.184452 0.152916
N  -1.24649 -1.62636 1.421174
N  -1.306421 -3.284783 0.014204
C  -3.318946 1.490846 0.321289
C  -2.3967 0.825136 -0.723149
C  -1.085033 0.248407 -0.15815
C  -4.535104 2.047333 -0.424976
C  -3.798207 0.528162 1.404663
C  -2.57864 2.666943 0.961369
C  -1.206907 -2.179272 -0.707715
C  1.214888 0.35075 -0.70328
C  -1.335023 -2.911907 1.317517
C  1.710267 1.288134 0.192331
C  2.041315 -0.627798 -1.230187
C  3.044617 1.247971 0.560544
C  3.380744 -0.663595 -0.872597
C  3.869933 0.27256 0.023508
H  -2.075949 1.628423 -1.398855
H  -0.817067 0.723199 0.786585
H  -5.163705 2.617013 0.260273
H  -4.237738 2.71923 -1.233659
H  -5.159495 1.260357 -0.850537
H  -2.9858 0.183571 2.044717
H  -4.298781 -0.346198 0.986339
H  -4.518762 1.032549 2.051067
H  -3.258087 3.231866 1.601943
H  -2.189686 3.354182 0.205902
H  -1.74247 2.352412 1.589245
H  -3.583163 0.191376 -2.127978
H  -1.142985 -2.131584 -1.781245
H  -1.41016 -3.602678 2.139734
H  1.068722 2.061977 0.594992
H  1.649244 -1.355108 -1.929246
H  3.433376 1.982025 1.252291
H  4.028069 -1.422199 -1.289763
H  -1.342271 -4.229698 -0.353474
elementType: Cl O N C H
totalener: -1319.77085375 hartree
nucrepener: 1748.82581737 hartree
electener: -3068.59667112 hartree
oneelecener: -5257.85000942 hartree
twoeener: 2189.25333830 hartree
cpcmener: -0.11581743 hartree
kineticenergy: 1315.26919625 hartree
xcener: -104.286138336289 hartree
chargesum: 1.0000000
charge: -0.096772 -0.415588 -0.350756 0.151873 -0.311916 -0.090088 0.234689 0.122057 0.120679 -0.347104 -0.372671 -0.353032 0.179882 0.207296 0.165938 -0.161515 -0.188163 -0.167836 -0.133043 0.093327 0.114537 0.167815 0.096677 0.107248 0.097527 0.095914 0.100479 0.106872 0.102191 0.106134 0.094434 0.233693 0.219836 0.201724 0.167816 0.155062 0.147480 0.148313 0.248991
qa: -0.0968 -0.4156 -0.3508 0.1519 -0.3119 -0.0901 0.2347 0.1221 0.1207 -0.3471 -0.3727 -0.3530 0.1799 0.2073 0.1659 -0.1615 -0.1882 -0.1678 -0.1330 0.0933 0.1145 0.1678 0.0967 0.1072 0.0975 0.0959 0.1005 0.1069 0.1022 0.1061 0.0944 0.2337 0.2198 0.2017 0.1678 0.1551 0.1475 0.1483 0.2490
va: 1.2053 2.0046 2.0128 3.4189 2.8852 3.5713 3.6706 3.8969 3.8168 3.9169 3.9283 3.9297 3.9399 3.8291 3.9237 3.9421 3.9942 3.9960 3.9729 3.8247 1.0185 0.9794 1.0063 1.0018 1.0118 1.0100 1.0158 1.0058 1.0039 1.0047 1.0066 1.0033 0.9835 0.9760 0.9882 0.9994 1.0044 1.0020 0.9644
dispersion: -0.020816496 hartree
energy: -1319.791670247201 hartree
dipole: -39.18273 35.75309 -3.42964 9.74810 -13.55108 -3.80298 1.72975 -2.52956 -0.79981
magnitude: 5.18312 au
magnitude: 13.17445 debye
