program: Orca
programVersion: 5.0.2
elementType: Cl O O N N N C C C C C C C C C C C C C C H H H H H H H H H H H H H H H H H H H
charge: 1
multiplicity: 1
keywords: wb97x-d3
keywords: def2-TZVPP
keywords: def2/J RIJCOSX
keywords: DEFGRID2
keywords: scfconv7
keywords: smallprint printgap noloewdin
keywords: NOSOSCF
formula: C14H19ClN3O2
InChI: InChI=1/C14H19ClN3O2/c1-14(2,3)12(19)13(18-9-16-8-17-18)20-11-6-4-10(15)5-7-11/h4-9,12-13,16,19H,1-3H3
39 atoms
Cl 5.612505 0.367433 0.348039
O  -2.984162 -0.077295 -1.473428
O  -0.100393 0.543207 -0.949631
N  -1.212065 -1.20705 0.083734
N  -1.358322 -1.805915 1.278662
N  -1.285847 -3.273786 -0.325463
C  -3.400932 1.40303 0.461055
C  -2.41657 0.874924 -0.605243
C  -1.120306 0.253639 -0.045005
C  -4.627453 1.953546 -0.273584
C  -3.853257 0.331931 1.450068
C  -2.741567 2.559548 1.214995
C  -1.163655 -2.084965 -0.894944
C  1.209855 0.457376 -0.567508
C  -1.40773 -3.069666 1.009978
C  2.12788 0.907121 -1.511095
C  1.649604 -0.027612 0.656265
C  3.481339 0.881247 -1.232437
C  3.010607 -0.051862 0.93485
C  3.916978 0.4009 -0.005516
H  -2.081986 1.755153 -1.169712
H  -0.904064 0.627869 0.957565
H  -4.346165 2.678683 -1.041369
H  -5.217924 1.167759 -0.747891
H  -5.286198 2.462948 0.431019
H  -4.267706 -0.54354 0.947699
H  -4.636561 0.734299 2.09509
H  -3.045174 0.000675 2.102811
H  -1.87027 2.248784 1.794208
H  -3.449436 2.998219 1.919862
H  -2.423003 3.351505 0.53355
H  -3.573725 0.376522 -2.085106
H  -1.027104 -1.898429 -1.947027
H  -1.521932 -3.859956 1.732457
H  1.780036 1.284774 -2.46382
H  0.974446 -0.392064 1.417791
H  4.187367 1.238329 -1.969653
H  3.34692 -0.429606 1.890604
H  -1.27944 -4.165444 -0.809264
elementType: Cl O N C H
totalener: -1319.77096394 hartree
nucrepener: 1744.99836609 hartree
electener: -3064.76933003 hartree
oneelecener: -5250.10994860 hartree
twoeener: 2185.34061857 hartree
cpcmener: -0.11422499 hartree
kineticenergy: 1315.24768696 hartree
xcener: -104.286146165820 hartree
chargesum: 1.0000000
charge: -0.100863 -0.409502 -0.318767 0.134691 -0.309996 -0.089775 0.239883 0.104899 0.104342 -0.354320 -0.370321 -0.349901 0.199263 0.341867 0.170010 -0.282929 -0.182906 -0.105981 -0.188792 0.077377 0.117873 0.184901 0.109885 0.097863 0.097026 0.101404 0.106632 0.094921 0.096443 0.100193 0.104301 0.232319 0.217410 0.202043 0.147885 0.138360 0.146470 0.145910 0.249885
qa: -0.1009 -0.4095 -0.3188 0.1347 -0.3100 -0.0898 0.2399 0.1049 0.1043 -0.3543 -0.3703 -0.3499 0.1993 0.3419 0.1700 -0.2829 -0.1829 -0.1060 -0.1888 0.0774 0.1179 0.1849 0.1099 0.0979 0.0970 0.1014 0.1066 0.0949 0.0964 0.1002 0.1043 0.2323 0.2174 0.2020 0.1479 0.1384 0.1465 0.1459 0.2499
va: 1.2020 2.0099 2.0619 3.3922 2.8764 3.5700 3.6471 3.9427 3.8259 3.9250 3.9259 3.9388 3.9330 3.6783 3.9147 4.0429 3.9140 3.9630 4.0409 3.8325 1.0157 0.9735 1.0008 1.0102 1.0060 1.0146 1.0063 1.0100 1.0076 1.0027 1.0050 1.0051 0.9844 0.9752 1.0077 1.0164 1.0021 1.0058 0.9635
dispersion: -0.020417940 hartree
energy: -1319.791381884984 hartree
dipole: -39.91175 36.30696 -3.60478 8.53885 -12.36014 -3.82129 2.93520 -4.08617 -1.15096
magnitude: 5.37786 au
magnitude: 13.66944 debye
