program: Orca
programVersion: 5.0.2
elementType: Cl O O N N N C C C C C C C C C C C C C C H H H H H H H H H H H H H H H H H H H
charge: 1
multiplicity: 1
keywords: wb97x-d3
keywords: def2-TZVPP
keywords: def2/J RIJCOSX
keywords: DEFGRID2
keywords: scfconv7
keywords: smallprint printgap noloewdin
keywords: NOSOSCF
formula: C14H19ClN3O2
InChI: InChI=1/C14H19ClN3O2/c1-14(2,3)12(19)13(18-9-16-8-17-18)20-11-6-4-10(15)5-7-11/h4-9,12-13,16,19H,1-3H3
39 atoms
Cl 5.435127 0.615451 0.529307
O  -3.565768 -0.542679 -0.2263
O  -0.276069 0.461892 -0.770727
N  -1.239097 -1.5717 -0.208082
N  -1.424139 -2.432894 0.804348
N  -1.310255 -3.477495 -1.101551
C  -2.965673 1.751494 0.424937
C  -2.610436 0.480698 -0.382209
C  -1.249866 -0.123138 0.02492
C  -3.282183 1.415545 1.882476
C  -1.821499 2.765931 0.374586
C  -4.198581 2.392269 -0.219416
C  -1.179708 -2.186083 -1.367064
C  1.036934 0.446487 -0.3928
C  -1.462215 -3.596822 0.240346
C  1.889614 1.192041 -1.199983
C  1.539478 -0.247179 0.698861
C  3.242281 1.245411 -0.919903
C  2.898604 -0.190198 0.980422
C  3.740637 0.551958 0.173645
H  -2.521977 0.760969 -1.441727
H  -1.057853 -0.003137 1.094308
H  -4.152502 0.766034 1.977449
H  -2.447163 0.932746 2.394753
H  -3.502348 2.332574 2.431705
H  -1.526363 3.000812 -0.649697
H  -0.935247 2.432906 0.917942
H  -2.143844 3.698118 0.841645
H  -4.009735 2.65901 -1.261511
H  -4.467107 3.306992 0.311689
H  -5.07471 1.740966 -0.191242
H  -4.371475 -0.278423 -0.682572
H  -1.049446 -1.743621 -2.341873
H  -1.585929 -4.536995 0.750239
H  1.493394 1.732323 -2.050067
H  0.915178 -0.843175 1.349741
H  3.89806 1.828376 -1.551953
H  3.284133 -0.733451 1.832124
H  -1.288329 -4.229207 -1.782228
elementType: Cl O N C H
totalener: -1319.77219821 hartree
nucrepener: 1745.73635434 hartree
electener: -3065.50855255 hartree
oneelecener: -5251.73195951 hartree
twoeener: 2186.22340696 hartree
cpcmener: -0.11993790 hartree
kineticenergy: 1315.25127640 hartree
xcener: -104.284728221143 hartree
chargesum: 1.0000000
charge: -0.100815 -0.424056 -0.312978 0.135658 -0.294426 -0.085389 0.229815 0.090246 0.099026 -0.343024 -0.346502 -0.343279 0.195142 0.329077 0.152518 -0.269411 -0.175591 -0.104370 -0.181118 0.078185 0.121809 0.177506 0.092367 0.096003 0.102554 0.103402 0.088263 0.102545 0.103657 0.098581 0.097267 0.238678 0.220870 0.202537 0.147975 0.135539 0.146743 0.146357 0.248639
qa: -0.1008 -0.4241 -0.3130 0.1357 -0.2944 -0.0854 0.2298 0.0902 0.0990 -0.3430 -0.3465 -0.3433 0.1951 0.3291 0.1525 -0.2694 -0.1756 -0.1044 -0.1811 0.0782 0.1218 0.1775 0.0924 0.0960 0.1026 0.1034 0.0883 0.1025 0.1037 0.0986 0.0973 0.2387 0.2209 0.2025 0.1480 0.1355 0.1467 0.1464 0.2486
va: 1.2018 2.0083 2.0445 3.4372 2.8920 3.5670 3.7346 3.9656 3.7962 3.9389 3.9529 3.9167 3.9374 3.6554 3.9497 4.0437 3.9329 3.9596 4.0345 3.8245 1.0075 0.9654 1.0219 1.0056 1.0027 1.0080 1.0039 1.0063 1.0034 1.0047 1.0107 1.0046 0.9714 0.9760 1.0076 1.0162 1.0022 1.0050 0.9643
dispersion: -0.020605220 hartree
energy: -1319.792803431034 hartree
dipole: -35.56433 32.03206 -3.53227 11.19052 -15.47655 -4.28603 1.01506 -3.66807 -2.65302
magnitude: 6.15512 au
magnitude: 15.64507 debye
