program: Orca
programVersion: 5.0.2
elementType: O N N N C C C C C C C C C C C C C C C C C Cl H H H H H H H H H H H H H H H H H H H H H
charge: 1
multiplicity: 1
keywords: wb97x-d3
keywords: def2-TZVPP
keywords: def2/J RIJCOSX
keywords: DEFGRID2
keywords: scfconv7
keywords: smallprint printgap noloewdin
keywords: NOSOSCF
formula: C17H21ClN3O
InChI: InChI=1/C17H21ClN3O/c1-16(2)8-7-14(9-13-3-5-15(18)6-4-13)17(16,22)10-21-12-19-11-20-21/h3-6,9,11-12,20,22H,7-8,10H2,1-2H3
43 atoms
O  1.431722 -0.771976 1.351009
N  0.346585 1.638122 0.413894
N  -0.529611 1.139058 1.290171
N  -1.535571 2.734127 0.210071
C  3.705469 -0.292869 0.461776
C  2.140315 -0.144533 0.299962
C  4.0182 -1.489486 -0.445968
C  1.843778 -0.803536 -1.050511
C  3.142964 -1.251595 -1.669139
C  1.771675 1.334412 0.411561
C  4.124847 -0.528155 1.906287
C  4.477186 0.927826 -0.061393
C  0.666429 -1.133385 -1.581183
C  -0.291426 2.613218 -0.218494
C  -1.66056 1.801723 1.141417
C  -0.710892 -0.948993 -1.075781
C  -3.373743 -0.728971 -0.290649
C  -1.224401 -1.751376 -0.057441
C  -1.570494 -0.051011 -1.70596
C  -2.895228 0.071639 -1.315406
C  -2.548096 -1.645372 0.340644
Cl -5.025352 -0.582262 0.208551
H  3.726863 -2.425571 0.041638
H  5.081811 -1.562517 -0.678208
H  3.01169 -2.136616 -2.291574
H  3.575775 -0.47473 -2.305892
H  2.175028 1.903827 -0.420291
H  2.182816 1.745733 1.336222
H  5.212261 -0.60938 1.960193
H  3.834181 0.298523 2.558501
H  3.71486 -1.447751 2.323617
H  4.2101 1.215746 -1.079471
H  4.352321 1.805686 0.574292
H  5.543339 0.695397 -0.066906
H  1.50945 -1.729589 1.269607
H  0.185283 3.213797 -0.977406
H  -2.545691 1.582517 1.717143
H  -0.59358 -2.487939 0.421689
H  -1.202866 0.566132 -2.51673
H  -3.54213 0.785087 -1.808274
H  -2.929582 -2.277617 1.13133
H  0.707328 -1.645141 -2.540871
H  -0.288765 0.337001 1.868496
elementType: O N C Cl H
totalener: -1360.05495881 hartree
nucrepener: 2063.77186117 hartree
electener: -3423.82681998 hartree
oneelecener: -5934.85654795 hartree
twoeener: 2511.02972797 hartree
cpcmener: -0.09787072 hartree
kineticenergy: 1355.28680852 hartree
xcener: -109.916964645676 hartree
chargesum: 1.0000000
charge: -0.434060 0.069260 0.005950 -0.353534 0.224391 0.465714 -0.200578 -0.261536 -0.107693 -0.135634 -0.328043 -0.386835 -0.016878 0.146318 0.170573 0.016299 0.092824 -0.223456 -0.211031 -0.154592 -0.135484 -0.093031 0.085572 0.086105 0.090740 0.095433 0.128437 0.169311 0.105767 0.098369 0.087740 0.109532 0.106076 0.104166 0.229716 0.189366 0.203129 0.143748 0.149691 0.141828 0.143175 0.133607 0.249547
qa: -0.4341 0.0693 0.0059 -0.3535 0.2244 0.4657 -0.2006 -0.2615 -0.1077 -0.1356 -0.3280 -0.3868 -0.0169 0.1463 0.1706 0.0163 0.0928 -0.2235 -0.2110 -0.1546 -0.1355 -0.0930 0.0856 0.0861 0.0907 0.0954 0.1284 0.1693 0.1058 0.0984 0.0877 0.1095 0.1061 0.1042 0.2297 0.1894 0.2031 0.1437 0.1497 0.1418 0.1432 0.1336 0.2495
va: 1.9964 3.4451 3.4434 3.0155 3.8027 3.7770 3.9231 3.8816 3.9250 3.8894 3.9444 3.9603 3.7434 4.0217 3.9566 3.5780 3.7834 3.9169 3.8628 3.9409 3.9833 1.2108 1.0140 1.0184 1.0183 1.0040 0.9907 0.9812 1.0014 1.0046 1.0116 0.9955 0.9973 1.0054 1.0138 0.9851 0.9730 1.0087 1.0056 1.0106 1.0073 0.9983 0.9962
dispersion: -0.028400955 hartree
energy: -1360.083359764030 hartree
dipole: 42.42438 -39.87466 2.54972 -1.29362 2.48632 1.19270 0.38781 0.56982 0.95763
magnitude: 2.97332 au
magnitude: 7.55759 debye
