program: Orca
programVersion: 5.0.2
elementType: O N N N C C C C C C C C C C C C C C C C C Cl H H H H H H H H H H H H H H H H H H H H H
charge: 1
multiplicity: 1
keywords: wb97x-d3
keywords: def2-TZVPP
keywords: def2/J RIJCOSX
keywords: DEFGRID2
keywords: scfconv7
keywords: smallprint printgap noloewdin
keywords: NOSOSCF
formula: C17H21ClN3O
InChI: InChI=1/C17H21ClN3O/c1-16(2)8-7-14(9-13-3-5-15(18)6-4-13)17(16,22)10-21-12-19-11-20-21/h3-6,9,11-12,19,22H,7-8,10H2,1-2H3
43 atoms
O  -1.46036 0.393789 1.557147
N  -0.48481 -1.773718 0.087566
N  -0.042969 -2.341488 -1.045001
N  1.601793 -2.005911 0.340201
C  -3.704967 0.291268 0.499835
C  -2.167192 0.028359 0.40098
C  -4.13664 0.228967 -0.967459
C  -1.769789 0.747305 -0.886499
C  -3.012661 0.924348 -1.734844
C  -1.902089 -1.47626 0.266592
C  -3.929393 1.709871 1.039427
C  -4.459263 -0.693014 1.38519
C  -0.576182 1.158865 -1.322453
C  0.500419 -1.553013 0.929731
C  1.231991 -2.470426 -0.883278
C  0.786372 1.064311 -0.766844
C  3.445697 0.852571 0.090114
C  1.174103 1.508367 0.498177
C  1.787466 0.576488 -1.612602
C  3.103284 0.460994 -1.196289
C  2.485769 1.396309 0.932225
Cl 5.070113 0.68288 0.635387
H  -5.108053 0.697262 -1.126256
H  -4.245371 -0.809538 -1.292883
H  -3.22841 1.987608 -1.862518
H  -2.880068 0.517078 -2.737899
H  -2.403175 -1.904215 -0.597508
H  -2.239267 -2.003593 1.159039
H  -4.978966 1.98191 0.929096
H  -3.709749 1.785731 2.106762
H  -3.351027 2.472818 0.512498
H  -5.499222 -0.381889 1.486441
H  -4.479688 -1.704249 0.975609
H  -4.03983 -0.737352 2.392134
H  -1.64075 1.317463 1.757181
H  0.426656 -1.108333 1.906677
H  1.911025 -2.893256 -1.604112
H  0.458828 1.98603 1.148792
H  1.531737 0.285562 -2.624486
H  3.861746 0.091074 -1.873543
H  2.767647 1.760462 1.911065
H  -0.586336 1.596266 -2.318787
H  2.540835 -1.925226 0.705045
totalener: -1359.97612281 hartree
nucrepener: 2066.38887365 hartree
electener: -3426.36499645 hartree
oneelecener: -5941.70211238 hartree
twoeener: 2515.33711593 hartree
kineticenergy: 1355.34088848 hartree
xcener: -109.928980117113 hartree
chargesum: 1.0000000
charge: -0.382939 0.127747 -0.228998 -0.106011 0.229031 0.563006 -0.250603 -0.337919 -0.104856 -0.208792 -0.391173 -0.320543 -0.032310 0.127815 0.123741 0.049500 0.005662 -0.180970 -0.203616 -0.168441 -0.114762 -0.023880 0.095346 0.089280 0.114587 0.105105 0.142182 0.156563 0.111891 0.099878 0.121855 0.114945 0.086319 0.107346 0.197551 0.210658 0.186617 0.126393 0.136531 0.146127 0.145062 0.116730 0.218341
qa: -0.3829 0.1277 -0.2290 -0.1060 0.2290 0.5630 -0.2506 -0.3379 -0.1049 -0.2088 -0.3912 -0.3205 -0.0323 0.1278 0.1237 0.0495 0.0057 -0.1810 -0.2036 -0.1684 -0.1148 -0.0239 0.0953 0.0893 0.1146 0.1051 0.1422 0.1566 0.1119 0.0999 0.1219 0.1149 0.0863 0.1073 0.1976 0.2107 0.1866 0.1264 0.1365 0.1461 0.1451 0.1167 0.2183
va: 2.0513 3.4556 2.8722 3.5360 3.6974 3.5769 3.9810 3.9645 3.8581 3.8792 3.9512 3.8998 3.7725 3.9557 3.9511 3.5271 3.9223 3.8965 3.8567 3.9194 3.9281 1.2843 1.0227 1.0145 1.0031 1.0144 1.0102 0.9898 1.0113 1.0047 0.9903 1.0071 0.9997 1.0109 1.0512 0.9962 0.9853 1.0225 1.0127 1.0101 1.0098 1.0081 0.9870
dispersion: -0.028455403 hartree
energy: -1360.004578209929 hartree
dipole: -39.69474 39.23679 -0.45795 1.59697 -3.23591 -1.63895 0.07291 0.34040 0.41331
magnitude: 1.75120 au
magnitude: 4.45119 debye
