program: Orca
programVersion: 5.0.2
elementType: O N N N C C C C C C C C C C C C C C C C C Cl H H H H H H H H H H H H H H H H H H H H H
charge: 1
multiplicity: 1
keywords: wb97x-d3
keywords: def2-TZVPP
keywords: def2/J RIJCOSX
keywords: DEFGRID2
keywords: scfconv7
keywords: smallprint printgap noloewdin
keywords: NOSOSCF
formula: C17H21ClN3O
InChI: InChI=1/C17H21ClN3O/c1-16(2)8-7-14(9-13-3-5-15(18)6-4-13)17(16,22)10-21-12-19-11-20-21/h3-6,9,11-12,19,22H,7-8,10H2,1-2H3
43 atoms
O  -1.297333 0.365206 1.45285
N  -0.519673 -2.01035 0.479883
N  -1.214758 -3.157224 0.421436
N  0.210106 -3.2020 2.062002
C  -3.249072 -0.243735 0.06457
C  -1.728083 0.142542 0.125849
C  -3.919153 1.136088 -0.026276
C  -1.652384 1.428731 -0.708851
C  -3.051031 1.917715 -1.001145
C  -0.758078 -0.906617 -0.436677
C  -3.756944 -1.014507 1.277201
C  -3.578924 -1.038487 -1.202616
C  -0.570913 2.104564 -1.106549
C  0.344276 -2.024216 1.468063
C  -0.757344 -3.876703 1.394642
C  0.861027 1.832194 -0.881353
C  3.587216 1.353722 -0.550398
C  1.412602 1.685429 0.391623
C  1.719402 1.770068 -1.981072
C  3.073115 1.521594 -1.827061
C  2.767703 1.444593 0.562666
Cl 5.278246 1.040311 -0.344386
H  -3.917021 1.623736 0.954527
H  -4.961672 1.061668 -0.339366
H  -3.136071 2.998091 -0.879815
H  -3.332409 1.695666 -2.034408
H  0.216155 -0.464533 -0.627111
H  -1.108283 -1.327241 -1.374116
H  -4.832393 -1.175171 1.175491
H  -3.299947 -1.99906 1.375578
H  -3.60503 -0.476693 2.213084
H  -3.209615 -2.063507 -1.152186
H  -4.661949 -1.094988 -1.326093
H  -3.176149 -0.589052 -2.112649
H  -1.815942 1.075138 1.849217
H  1.039128 -1.243352 1.730002
H  -1.085934 -4.870237 1.648745
H  0.783838 1.768344 1.265854
H  1.322266 1.903974 -2.979925
H  3.716885 1.462081 -2.69438
H  3.175911 1.337262 1.558952
H  -0.75993 2.989463 -1.710925
H  0.742599 -3.530205 2.859929
elementType: O N C Cl H
totalener: -1360.06889510 hartree
nucrepener: 1999.40598317 hartree
electener: -3359.47487826 hartree
oneelecener: -5808.56862103 hartree
twoeener: 2449.09374276 hartree
cpcmener: -0.09889097 hartree
kineticenergy: 1355.28998488 hartree
xcener: -109.913075445723 hartree
chargesum: 1.0000000
charge: -0.414480 0.190234 -0.332693 -0.096019 0.250384 0.524018 -0.222567 -0.345914 -0.087590 -0.264785 -0.340725 -0.386630 -0.017343 0.184538 0.167684 0.007530 0.114158 -0.227697 -0.188750 -0.166870 -0.162768 -0.094050 0.085651 0.084389 0.093395 0.094927 0.191110 0.162464 0.108631 0.098921 0.088676 0.100402 0.102914 0.109743 0.224045 0.213407 0.199417 0.147837 0.142585 0.144590 0.144500 0.130563 0.242169
qa: -0.4145 0.1902 -0.3327 -0.0960 0.2504 0.5240 -0.2226 -0.3459 -0.0876 -0.2648 -0.3407 -0.3866 -0.0173 0.1845 0.1677 0.0075 0.1142 -0.2277 -0.1887 -0.1669 -0.1628 -0.0941 0.0857 0.0844 0.0934 0.0949 0.1911 0.1625 0.1086 0.0989 0.0887 0.1004 0.1029 0.1097 0.2240 0.2134 0.1994 0.1478 0.1426 0.1446 0.1445 0.1306 0.2422
va: 2.0178 3.3751 2.8667 3.5677 3.7326 3.6478 3.9527 4.0117 3.8977 3.7934 3.9194 3.9555 3.7456 3.9356 3.9099 3.6570 3.8316 3.9065 3.9840 3.9875 3.9868 1.2120 1.0131 1.0179 1.0147 1.0025 0.9899 0.9999 1.0003 1.0078 1.0158 1.0107 1.0068 0.9946 1.0170 0.9787 0.9768 1.0349 1.0067 1.0058 1.0069 0.9984 0.9685
dispersion: -0.025486033 hartree
energy: -1360.094381128780 hartree
dipole: -37.14208 35.89311 -1.24897 -2.95881 -0.67908 -3.63789 0.01596 2.60741 2.62337
magnitude: 4.65578 au
magnitude: 11.83404 debye
