program: Orca
programVersion: 5.0.2
elementType: O N N N C C C C C C C C C C C C C C C C C Cl H H H H H H H H H H H H H H H H H H H H H
charge: 1
multiplicity: 1
keywords: wb97x-d3
keywords: def2-TZVPP
keywords: def2/J RIJCOSX
keywords: DEFGRID2
keywords: scfconv7
keywords: smallprint printgap noloewdin
keywords: NOSOSCF
formula: C17H21ClN3O
InChI: InChI=1/C17H21ClN3O/c1-16(2)8-7-14(9-13-3-5-15(18)6-4-13)17(16,22)10-21-12-19-11-20-21/h3-6,9,11-12,19,22H,7-8,10H2,1-2H3
43 atoms
O  -1.600923 0.3283 1.623309
N  -0.520031 -1.776778 0.090255
N  0.18973 -2.023832 1.204186
N  1.458012 -2.130317 -0.55861
C  -3.768597 0.260053 0.4390
C  -2.219674 0.021891 0.405976
C  -4.125195 0.3312 -1.046093
C  -1.766267 0.835274 -0.806752
C  -2.977851 1.115492 -1.675238
C  -1.937363 -1.471353 0.164784
C  -4.048892 1.613908 1.101465
C  -4.555113 -0.81159 1.182775
C  -0.558095 1.258606 -1.203545
C  0.236158 -1.837553 -0.981965
C  1.397132 -2.234977 0.791551
C  0.818405 1.124558 -0.700734
C  3.517813 0.841275 -0.014013
C  1.219996 1.061268 0.634724
C  1.823609 1.078622 -1.676597
C  3.159017 0.925615 -1.350464
C  2.556514 0.923213 0.978787
Cl 5.182695 0.643687 0.416924
H  -5.096929 0.798922 -1.210679
H  -4.185426 -0.673598 -1.473008
H  -3.195366 2.186764 -1.671455
H  -2.802505 0.841025 -2.716499
H  -2.393645 -1.814853 -0.761014
H  -2.328525 -2.075874 0.981154
H  -5.097531 1.879858 0.960345
H  -3.874611 1.586377 2.178789
H  -3.454539 2.432879 0.688388
H  -4.539136 -1.778307 0.677002
H  -4.185998 -0.954165 2.2009
H  -5.60285 -0.514984 1.26019
H  -1.69975 1.271449 1.798275
H  -0.078422 -1.693092 -2.00244
H  2.242573 -2.467048 1.416912
H  0.495968 1.124772 1.429724
H  1.551808 1.150993 -2.722951
H  3.907242 0.878514 -2.1306
H  2.838705 0.879841 2.022404
H  -0.575765 1.770612 -2.163922
H  2.279201 -2.236922 -1.143303
elementType: O N C Cl H
totalener: -1360.06874363 hartree
nucrepener: 2056.52058300 hartree
electener: -3416.58932662 hartree
oneelecener: -5921.55195624 hartree
twoeener: 2504.96262961 hartree
cpcmener: -0.10283421 hartree
kineticenergy: 1355.29458320 hartree
xcener: -109.920182356175 hartree
chargesum: 1.0000000
charge: -0.392486 0.135963 -0.275198 -0.091800 0.232658 0.551774 -0.239536 -0.334052 -0.079511 -0.158956 -0.386761 -0.349232 -0.079638 0.152726 0.135183 0.009239 0.151306 -0.246110 -0.130199 -0.224863 -0.164457 -0.090709 0.084459 0.085154 0.103492 0.089050 0.156020 0.140841 0.102664 0.101761 0.114116 0.092350 0.103437 0.106471 0.229631 0.223248 0.198160 0.166721 0.134561 0.143119 0.142981 0.110590 0.245833
qa: -0.3925 0.1360 -0.2752 -0.0918 0.2327 0.5518 -0.2395 -0.3341 -0.0795 -0.1590 -0.3868 -0.3492 -0.0796 0.1527 0.1352 0.0092 0.1513 -0.2461 -0.1302 -0.2249 -0.1645 -0.0907 0.0845 0.0852 0.1035 0.0890 0.1560 0.1408 0.1027 0.1018 0.1141 0.0923 0.1034 0.1065 0.2296 0.2232 0.1982 0.1667 0.1346 0.1431 0.1430 0.1106 0.2458
va: 2.0653 3.4673 2.8966 3.5435 3.7829 3.7089 3.9933 3.9552 3.8613 3.8309 3.9498 3.8984 3.7177 3.9398 3.9584 3.5772 3.7775 3.8658 3.9145 4.0137 3.9746 1.2158 1.0173 1.0109 1.0012 1.0140 0.9925 1.0110 1.0061 1.0071 0.9923 0.9991 1.0107 1.0019 1.0021 0.9674 0.9810 1.0263 1.0085 1.0083 1.0099 1.0090 0.9666
dispersion: -0.027953317 hartree
energy: -1360.096696942995 hartree
dipole: -40.72803 40.06373 -0.66430 1.07420 -3.79972 -2.72552 -2.97033 0.67974 -2.29060
magnitude: 3.62169 au
magnitude: 9.20559 debye
