program: Orca
programVersion: 5.0.2
elementType: O N N N C C C C C C C C C C C C C C C C C Cl H H H H H H H H H H H H H H H H H H H H H
charge: 1
multiplicity: 1
keywords: wb97x-d3
keywords: def2-TZVPP
keywords: def2/J RIJCOSX
keywords: DEFGRID2
keywords: scfconv7
keywords: smallprint printgap noloewdin
keywords: NOSOSCF
formula: C17H21ClN3O
InChI: InChI=1/C17H21ClN3O/c1-16(2)8-7-14(9-13-3-5-15(18)6-4-13)17(16,22)10-21-12-19-11-20-21/h3-6,9,11-12,19,22H,7-8,10H2,1-2H3
43 atoms
O  -0.830519 0.195755 1.058479
N  -0.519616 -2.120615 -0.077035
N  -1.1013 -3.277592 0.27758
N  0.928057 -3.166348 1.048607
C  -3.208122 -0.019567 0.396024
C  -1.7112 0.098273 -0.025298
C  -3.929132 0.36814 -0.899115
C  -1.718629 1.310354 -0.957622
C  -3.123892 1.54361 -1.456576
C  -1.198806 -1.105462 -0.865457
C  -3.508404 1.021046 1.481727
C  -3.629191 -1.385647 0.914896
C  -0.661964 2.044065 -1.30047
C  0.708423 -2.041425 0.383041
C  -0.20527 -3.90633 0.96547
C  0.741024 1.81306 -0.879533
C  3.375646 1.340326 -0.107765
C  1.256602 2.376558 0.2856
C  1.589649 1.038996 -1.667703
C  2.901686 0.792442 -1.287985
C  2.564773 2.14357 0.67969
Cl 5.003859 1.01712 0.390851
H  -4.977349 0.614843 -0.724578
H  -3.917308 -0.468386 -1.604131
H  -3.50887 2.494582 -1.080638
H  -3.164761 1.600647 -2.545237
H  -0.472766 -0.763879 -1.599225
H  -1.997146 -1.599731 -1.413359
H  -3.048771 0.758026 2.436324
H  -3.180059 2.03053 1.222981
H  -4.584912 1.070945 1.653205
H  -3.551254 -2.168615 0.160465
H  -3.041948 -1.689769 1.783654
H  -4.674041 -1.353254 1.230815
H  -0.955156 1.044768 1.497436
H  1.406469 -1.234277 0.227967
H  -0.323401 -4.880355 1.409733
H  0.627036 3.003808 0.904485
H  1.22474 0.612059 -2.593962
H  3.540478 0.178877 -1.909407
H  2.942426 2.581386 1.594091
H  -0.82165 2.87808 -1.980739
H  1.789481 -3.421047 1.518569
elementType: O N C Cl H
totalener: -1360.06739617 hartree
nucrepener: 2023.93549601 hartree
electener: -3384.00289217 hartree
oneelecener: -5857.11381988 hartree
twoeener: 2473.11092771 hartree
cpcmener: -0.09754370 hartree
kineticenergy: 1355.29417596 hartree
xcener: -109.913839590574 hartree
chargesum: 1.0000000
charge: -0.408467 0.185801 -0.309273 -0.102218 0.310398 0.620658 -0.257697 -0.388994 -0.060784 -0.337343 -0.385064 -0.363561 -0.047219 0.190546 0.159981 0.041666 0.110004 -0.196750 -0.237537 -0.164402 -0.161383 -0.097250 0.084784 0.087979 0.098008 0.090838 0.185059 0.158064 0.099947 0.111914 0.102457 0.092250 0.100196 0.109218 0.225313 0.202368 0.199407 0.145738 0.147010 0.142029 0.143634 0.131132 0.241544
qa: -0.4085 0.1858 -0.3093 -0.1022 0.3104 0.6207 -0.2577 -0.3890 -0.0608 -0.3373 -0.3851 -0.3636 -0.0472 0.1905 0.1600 0.0417 0.1100 -0.1967 -0.2375 -0.1644 -0.1614 -0.0973 0.0848 0.0880 0.0980 0.0908 0.1851 0.1581 0.0999 0.1119 0.1025 0.0922 0.1002 0.1092 0.2253 0.2024 0.1994 0.1457 0.1470 0.1420 0.1436 0.1311 0.2415
va: 2.0252 3.3558 2.8788 3.5738 3.6490 3.4770 4.0074 3.9338 3.8394 3.8171 3.9532 3.8914 3.7802 3.9420 3.9238 3.6330 3.8110 3.9419 3.9309 3.9534 3.9973 1.2065 1.0167 1.0113 1.0026 1.0150 0.9870 1.0064 1.0082 0.9933 1.0058 1.0080 1.0080 1.0053 1.0163 0.9904 0.9771 1.0047 1.0056 1.0068 1.0054 0.9959 0.9692
dispersion: -0.026273487 hartree
energy: -1360.093669655044 hartree
dipole: -35.88639 35.53893 -0.34747 -0.76483 -2.71451 -3.47935 -0.11402 0.81042 0.69641
magnitude: 3.56533 au
magnitude: 9.06234 debye
