program: Orca
programVersion: 5.0.2
elementType: O N N N C C C C C C C C C C C C C C C C C Cl H H H H H H H H H H H H H H H H H H H H H
charge: 1
multiplicity: 1
keywords: wb97x-d3
keywords: def2-TZVPP
keywords: def2/J RIJCOSX
keywords: DEFGRID2
keywords: scfconv7
keywords: smallprint printgap noloewdin
keywords: NOSOSCF
formula: C17H21ClN3O
InChI: InChI=1/C17H21ClN3O/c1-16(2)8-7-14(9-13-3-5-15(18)6-4-13)17(16,22)10-21-12-19-11-20-21/h3-6,9,11-12,19,22H,7-8,10H2,1-2H3
43 atoms
O  -1.333447 0.174578 1.578882
N  -0.607312 -2.155225 0.337648
N  -1.189917 -3.282409 -0.102579
N  -0.135146 -3.640638 1.762369
C  -3.213063 -0.30622 0.051712
C  -1.702757 0.082751 0.216671
C  -3.896044 1.066935 0.13442
C  -1.612767 1.450943 -0.469419
C  -3.011373 1.976289 -0.705365
C  -0.707268 -0.903883 -0.401632
C  -3.747141 -1.250034 1.122035
C  -3.488973 -0.909132 -1.329384
C  -0.536792 2.169891 -0.80561
C  0.035845 -2.359567 1.464659
C  -0.892525 -4.182182 0.777892
C  0.903908 1.913834 -0.649099
C  3.658649 1.514858 -0.470769
C  1.745451 2.194366 -1.728689
C  1.487842 1.462593 0.53602
C  2.856189 1.258839 0.629121
C  3.112258 1.988686 -1.653695
Cl 5.367396 1.256466 -0.362042
H  -3.925401 1.417278 1.171715
H  -4.92925 1.02876 -0.213573
H  -3.099439 3.029055 -0.434858
H  -3.276727 1.902172 -1.763531
H  0.293466 -0.481527 -0.420294
H  -0.969676 -1.156549 -1.424243
H  -3.306161 -2.246139 1.070731
H  -3.600891 -0.867339 2.131894
H  -4.822715 -1.378426 0.982655
H  -3.059207 -0.329049 -2.148602
H  -3.111543 -1.928485 -1.418385
H  -4.566307 -0.952664 -1.499791
H  -1.85527 0.857815 2.015838
H  0.607933 -1.640628 2.026438
H  -1.193163 -5.215746 0.744917
H  1.323198 2.570995 -2.652431
H  0.872472 1.273574 1.404189
H  3.288828 0.910506 1.557616
H  3.741328 2.199707 -2.50814
H  -0.749468 3.109838 -1.311097
H  0.245737 -4.116223 2.572894
elementType: O N C Cl H
totalener: -1360.06963406 hartree
nucrepener: 1988.13695694 hartree
electener: -3348.20659101 hartree
oneelecener: -5786.17295247 hartree
twoeener: 2437.96636147 hartree
cpcmener: -0.09972455 hartree
kineticenergy: 1355.28517247 hartree
xcener: -109.913036211167 hartree
chargesum: 1.0000000
charge: -0.420819 0.174707 -0.318462 -0.093811 0.247326 0.549658 -0.229327 -0.350130 -0.085586 -0.275031 -0.342197 -0.386488 -0.005941 0.191292 0.161222 -0.019610 0.114361 -0.176623 -0.229561 -0.157458 -0.173460 -0.093555 0.085217 0.084222 0.094535 0.096037 0.198069 0.158170 0.096253 0.091021 0.109897 0.110496 0.100638 0.103716 0.226161 0.210500 0.198951 0.140640 0.160309 0.141630 0.143874 0.126642 0.242514
qa: -0.4208 0.1747 -0.3185 -0.0938 0.2473 0.5497 -0.2293 -0.3501 -0.0856 -0.2750 -0.3422 -0.3865 -0.0059 0.1913 0.1612 -0.0196 0.1144 -0.1766 -0.2296 -0.1575 -0.1735 -0.0936 0.0852 0.0842 0.0945 0.0960 0.1981 0.1582 0.0963 0.0910 0.1099 0.1105 0.1006 0.1037 0.2262 0.2105 0.1990 0.1406 0.1603 0.1416 0.1439 0.1266 0.2425
va: 2.0083 3.3814 2.8631 3.5644 3.7525 3.6063 3.9589 4.0237 3.8961 3.8098 3.9121 3.9559 3.7470 3.9291 3.9151 3.6218 3.8310 3.9880 3.8928 4.0043 4.0022 1.2126 1.0138 1.0178 1.0138 1.0018 0.9830 1.0027 1.0064 1.0182 1.0017 0.9946 1.0117 1.0064 1.0163 0.9801 0.9770 1.0061 1.0339 1.0089 1.0061 0.9992 0.9681
dispersion: -0.025136370 hartree
energy: -1360.094770434391 hartree
dipole: -37.41995 35.60600 -1.81395 -3.86799 -0.40175 -4.26974 0.36084 2.14072 2.50156
magnitude: 5.27057 au
magnitude: 13.39672 debye
