program: Orca
programVersion: 5.0.2
elementType: Cl O N N N C C C C C C C C C C C C C C C C C H H H H H H H H H H H H H H H H H H H H H
charge: 1
multiplicity: 1
keywords: wb97x-d3
keywords: def2-TZVPP
keywords: def2/J RIJCOSX
keywords: DEFGRID2
keywords: scfconv7
keywords: smallprint printgap noloewdin
keywords: NOSOSCF
formula: C17H21ClN3O
InChI: InChI=1/C17H21ClN3O/c1-16(2)8-7-14(9-13-3-5-15(18)6-4-13)17(16,22)10-21-12-19-11-20-21/h3-6,9,11-12,20,22H,7-8,10H2,1-2H3
43 atoms
Cl -6.572523 -1.580297 0.088232
O  1.734797 0.642289 1.4758
N  3.086331 2.118161 -0.467686
N  3.471333 2.440831 0.770109
N  4.868219 3.381338 -0.608899
C  2.603542 -1.083114 -0.109193
C  1.653687 0.120072 0.160212
C  1.971848 -1.698163 -1.363012
C  0.281787 -0.437852 -0.195107
C  0.457031 -1.569255 -1.170478
C  1.869139 1.34563 -0.744307
C  2.492175 -2.071071 1.058713
C  4.074918 -0.746941 -0.31933
C  -0.831596 0.034712 0.376865
C  -2.219356 -0.392213 0.237711
C  3.948921 2.712767 -1.281966
C  -3.152784 0.151288 1.126234
C  -2.686573 -1.308027 -0.709876
C  4.558286 3.191817 0.65906
C  -4.486793 -0.205227 1.091509
C  -4.019706 -1.66997 -0.759409
C  -4.918347 -1.122794 0.145329
H  2.290463 -2.730105 -1.51022
H  2.292448 -1.155109 -2.257501
H  0.024861 -2.490347 -0.769707
H  -0.048413 -1.382746 -2.120289
H  1.021084 2.023766 -0.63337
H  1.927768 1.053537 -1.79123
H  3.007551 -2.997353 0.805328
H  2.968487 -1.692383 1.964858
H  1.461266 -2.340342 1.299293
H  4.643994 -1.667061 -0.455436
H  4.252211 -0.149516 -1.214804
H  4.516448 -0.237796 0.539673
H  2.976639 1.994861 1.549583
H  -0.705252 0.852135 1.083505
H  3.880174 2.641827 -2.356711
H  -2.827482 0.869307 1.869377
H  -2.021892 -1.745392 -1.438108
H  5.094126 3.580611 1.511021
H  -5.187795 0.225341 1.79264
H  -4.362593 -2.376512 -1.502295
H  1.390898 -0.006941 2.100516
totalener: -1359.96981353 hartree
nucrepener: 1916.74353361 hartree
electener: -3276.71334714 hartree
oneelecener: -5643.04002056 hartree
twoeener: 2366.32667343 hartree
kineticenergy: 1355.32347802 hartree
xcener: -109.925692279437 hartree
chargesum: 1.0000000
charge: -0.033742 -0.400864 0.072296 -0.062218 -0.273919 0.333388 0.450878 -0.297458 -0.291805 -0.121594 -0.262334 -0.370754 -0.344813 -0.043478 0.040015 0.150839 -0.128945 -0.211239 0.177910 -0.155074 -0.136341 0.106161 0.101011 0.090564 0.123682 0.104705 0.172991 0.141756 0.111025 0.098559 0.123824 0.126644 0.078902 0.099931 0.236092 0.098975 0.180001 0.110389 0.138823 0.190643 0.131865 0.127985 0.214724
qa: -0.0337 -0.4009 0.0723 -0.0622 -0.2739 0.3334 0.4509 -0.2975 -0.2918 -0.1216 -0.2623 -0.3708 -0.3448 -0.0435 0.0400 0.1508 -0.1289 -0.2112 0.1779 -0.1551 -0.1363 0.1062 0.1010 0.0906 0.1237 0.1047 0.1730 0.1418 0.1110 0.0986 0.1238 0.1266 0.0789 0.0999 0.2361 0.0990 0.1800 0.1104 0.1388 0.1906 0.1319 0.1280 0.2147
va: 1.2760 1.9933 3.3819 3.4181 3.0715 3.5484 3.7053 4.0157 3.6772 3.8871 3.9127 3.9514 3.9258 3.8573 3.7501 3.9913 4.0126 4.0328 3.9568 4.0423 4.0585 3.9913 1.0222 1.0099 0.9962 1.0056 0.9915 0.9920 1.0111 1.0051 0.9919 1.0112 1.0023 1.0080 1.0341 1.0430 0.9855 1.0157 1.0006 0.9783 1.0122 1.0151 1.0309
dispersion: -0.023391004 hartree
energy: -1359.993204535182 hartree
dipole: 33.81715 -29.27643 4.54072 -5.11523 7.02490 1.90967 -1.49789 1.74644 0.24855
magnitude: 4.93222 au
magnitude: 12.53670 debye
