program: Orca
programVersion: 5.0.2
elementType: Cl O N N N C C C C C C C C C C C C C C C C C H H H H H H H H H H H H H H H H H H H H H
charge: 1
multiplicity: 1
keywords: wb97x-d3
keywords: def2-TZVPP
keywords: def2/J RIJCOSX
keywords: DEFGRID2
keywords: scfconv7
keywords: smallprint printgap noloewdin
keywords: NOSOSCF
formula: C17H21ClN3O
InChI: InChI=1/C17H21ClN3O/c1-16(2)8-7-14(9-13-3-5-15(18)6-4-13)17(16,22)10-21-12-19-11-20-21/h3-6,9,11-12,20,22H,7-8,10H2,1-2H3
43 atoms
Cl -6.006634 -0.096168 -0.13015
O  2.621446 -0.096743 1.581044
N  2.319594 1.778442 -0.426672
N  1.213706 2.177184 -1.060633
N  1.708959 3.710236 0.393978
C  3.04416 -1.967603 -0.014357
C  2.387031 -0.589292 0.2933
C  2.298413 -2.394425 -1.284155
C  0.925149 -0.824362 -0.054246
C  0.856726 -1.891341 -1.112304
C  2.964433 0.492765 -0.640118
C  2.722501 -2.938459 1.125347
C  4.553637 -1.9155 -0.206838
C  -0.059797 -0.161008 0.560548
C  -1.504767 -0.208716 0.344623
C  2.59143 2.72622 0.456933
C  -2.311231 0.540663 1.209677
C  -2.144363 -0.920652 -0.676316
C  0.864602 3.345705 -0.555615
C  -3.687887 0.580189 1.078593
C  -3.521394 -0.890784 -0.820703
C  -4.286904 -0.140124 0.057232
H  2.342941 -3.473974 -1.432521
H  2.759442 -1.942967 -2.166022
H  0.189546 -2.695923 -0.792989
H  0.451763 -1.514413 -2.05487
H  2.858612 0.236773 -1.693014
H  4.022476 0.6564 -0.440111
H  3.055477 -3.94164 0.855428
H  3.238207 -2.67133 2.049735
H  1.65417 -3.003701 1.345325
H  5.057303 -1.482717 0.660259
H  4.949153 -2.924301 -0.338642
H  4.848059 -1.345401 -1.089585
H  0.78459 1.628372 -1.79977
H  0.231244 0.534674 1.343754
H  3.444556 2.67146 1.114224
H  -1.849211 1.109581 2.007631
H  -1.580976 -1.503715 -1.388105
H  0.00314 3.894611 -0.901469
H  -4.282578 1.168908 1.764269
H  -3.989935 -1.448433 -1.620647
H  2.146952 -0.636133 2.224987
elementType: Cl O N C H
totalener: -1360.06846964 hartree
nucrepener: 1969.22245278 hartree
electener: -3329.29092243 hartree
oneelecener: -5746.49496595 hartree
twoeener: 2417.20404352 hartree
cpcmener: -0.10750360 hartree
kineticenergy: 1355.28043804 hartree
xcener: -109.918324134489 hartree
chargesum: 1.0000000
charge: -0.091178 -0.409267 0.095404 -0.035371 -0.356880 0.254351 0.564477 -0.272415 -0.382592 -0.106244 -0.166842 -0.362357 -0.353242 -0.087402 0.084459 0.160475 -0.172093 -0.240899 0.191412 -0.176389 -0.165422 0.124919 0.086185 0.090936 0.116727 0.094446 0.166625 0.148292 0.100988 0.099886 0.114146 0.104632 0.107548 0.091975 0.247929 0.111799 0.193786 0.139624 0.164601 0.204871 0.142899 0.140346 0.234854
qa: -0.0912 -0.4093 0.0954 -0.0354 -0.3569 0.2544 0.5645 -0.2724 -0.3826 -0.1062 -0.1668 -0.3624 -0.3532 -0.0874 0.0845 0.1605 -0.1721 -0.2409 0.1914 -0.1764 -0.1654 0.1249 0.0862 0.0909 0.1167 0.0944 0.1666 0.1483 0.1010 0.0999 0.1141 0.1046 0.1075 0.0920 0.2479 0.1118 0.1938 0.1396 0.1646 0.2049 0.1429 0.1403 0.2349
va: 1.2149 2.0566 3.3775 3.5063 3.0461 3.7472 3.6787 4.0410 3.6011 3.8679 3.8064 3.9402 3.9055 3.6545 3.6522 4.0025 3.9921 3.9941 3.9399 4.0113 4.0450 3.8233 1.0162 1.0091 0.9933 1.0078 0.9878 0.9964 1.0054 1.0083 0.9930 1.0092 1.0021 0.9995 0.9662 1.0454 0.9882 1.0080 0.9923 0.9732 1.0070 1.0099 1.0068
dispersion: -0.024479219 hartree
energy: -1360.092948863580 hartree
dipole: 36.51104 -32.53607 3.97498 -15.46189 16.90238 1.44050 -2.02230 0.05725 -1.96505
magnitude: 4.66228 au
magnitude: 11.85058 debye
