program: Orca
programVersion: 5.0.2
elementType: Cl O N N N C C C C C C C C C C C C C C C C C H H H H H H H H H H H H H H H H H H H H H
charge: 1
multiplicity: 1
keywords: wb97x-d3
keywords: def2-TZVPP
keywords: def2/J RIJCOSX
keywords: DEFGRID2
keywords: scfconv7
keywords: smallprint printgap noloewdin
keywords: NOSOSCF
formula: C17H21ClN3O
InChI: InChI=1/C17H21ClN3O/c1-16(2)8-7-14(9-13-3-5-15(18)6-4-13)17(16,22)10-21-12-19-11-20-21/h3-6,9,11-12,20,22H,7-8,10H2,1-2H3
43 atoms
Cl -5.983935 0.011885 -0.253989
O  2.617562 -0.1069 1.642954
N  2.239398 1.704166 -0.491416
N  2.306994 2.518499 0.565051
N  0.899177 3.396303 -0.836578
C  3.061258 -1.99794 0.079061
C  2.388759 -0.621794 0.357986
C  2.302158 -2.46884 -1.166812
C  0.927375 -0.870913 0.01641
C  0.852643 -2.009284 -0.963737
C  2.96251 0.448545 -0.589935
C  2.774924 -2.940474 1.251187
C  4.566656 -1.929818 -0.140815
C  -0.055513 -0.147619 0.564566
C  -1.498916 -0.187543 0.334648
C  1.37261 2.260176 -1.322803
C  -2.163147 -1.103145 -0.488929
C  -2.277286 0.782402 0.977938
C  1.493674 3.533012 0.335774
C  -3.535534 -1.047194 -0.666656
C  -3.648196 0.853584 0.807633
C  -4.271181 -0.065854 -0.021424
H  2.378239 -3.548491 -1.301451
H  2.726423 -2.014393 -2.065583
H  0.244043 -2.81862 -0.552075
H  0.380007 -1.718406 -1.905054
H  2.893465 0.149229 -1.633572
H  4.009995 0.653533 -0.365852
H  3.307051 -2.640628 2.155846
H  1.712718 -3.011469 1.497202
H  3.114317 -3.946932 1.0022
H  4.973146 -2.936648 -0.252683
H  4.837988 -1.380042 -1.043714
H  5.079977 -1.467541 0.705128
H  2.888886 2.306204 1.369926
H  0.234245 0.607153 1.29125
H  1.120905 1.813681 -2.272144
H  -1.624972 -1.881503 -1.006729
H  -1.796836 1.504836 1.62689
H  1.360018 4.34276 1.035054
H  -4.02356 -1.767697 -1.309335
H  -4.220639 1.618679 1.314881
H  2.109484 -0.611889 2.289603
elementType: Cl O N C H
totalener: -1360.07025683 hartree
nucrepener: 1969.94763962 hartree
electener: -3330.01789645 hartree
oneelecener: -5748.44148373 hartree
twoeener: 2418.42358728 hartree
cpcmener: -0.10521102 hartree
kineticenergy: 1355.27823149 hartree
xcener: -109.917757066749 hartree
chargesum: 1.0000000
charge: -0.092051 -0.415357 0.087141 -0.024776 -0.353480 0.249624 0.497320 -0.258477 -0.264380 -0.115336 -0.155283 -0.364428 -0.349157 -0.118442 0.080124 0.160963 -0.245380 -0.165524 0.187615 -0.161473 -0.183429 0.125792 0.085572 0.089394 0.110627 0.102434 0.144114 0.162004 0.099890 0.111966 0.101540 0.107348 0.091579 0.103685 0.245893 0.106511 0.192701 0.161906 0.138331 0.203296 0.140026 0.142819 0.236757
qa: -0.0921 -0.4154 0.0871 -0.0248 -0.3535 0.2496 0.4973 -0.2585 -0.2644 -0.1153 -0.1553 -0.3644 -0.3492 -0.1184 0.0801 0.1610 -0.2454 -0.1655 0.1876 -0.1615 -0.1834 0.1258 0.0856 0.0894 0.1106 0.1024 0.1441 0.1620 0.0999 0.1120 0.1015 0.1073 0.0916 0.1037 0.2459 0.1065 0.1927 0.1619 0.1383 0.2033 0.1400 0.1428 0.2368
va: 1.2140 2.0253 3.4114 3.4915 3.0322 3.7572 3.7573 4.0218 3.5931 3.8888 3.8338 3.9424 3.9067 3.7154 3.6675 3.9919 4.0062 3.9858 3.9456 4.0440 4.0260 3.8196 1.0159 1.0104 0.9930 1.0039 0.9935 0.9899 1.0086 0.9935 1.0054 1.0024 1.0006 1.0090 0.9830 1.0457 0.9828 0.9954 1.0079 0.9734 1.0098 1.0073 1.0051
dispersion: -0.024362569 hartree
energy: -1360.094619398947 hartree
dipole: 37.78427 -32.37405 5.41022 -15.59101 17.43774 1.84673 0.93143 -0.62966 0.30177
magnitude: 5.72468 au
magnitude: 14.55098 debye
