program: Orca
programVersion: 5.0.2
elementType: Cl O N N N C C C C C C C C C C C C C C C C C H H H H H H H H H H H H H H H H H H H H H
charge: 1
multiplicity: 1
keywords: wb97x-d3
keywords: def2-TZVPP
keywords: def2/J RIJCOSX
keywords: DEFGRID2
keywords: scfconv7
keywords: smallprint printgap noloewdin
keywords: NOSOSCF
formula: C17H21ClN3O
InChI: InChI=1/C17H21ClN3O/c1-16(2)8-7-14(9-13-3-5-15(18)6-4-13)17(16,22)10-21-12-19-11-20-21/h3-6,9,11-12,20,22H,7-8,10H2,1-2H3
43 atoms
Cl -5.992761 -0.042464 -0.152079
O  2.632862 -0.1163 1.586667
N  2.294031 1.768531 -0.414188
N  1.190439 2.15762 -1.05809
N  1.64332 3.68163 0.419579
C  3.064739 -1.969958 -0.026854
C  2.395632 -0.601176 0.29633
C  2.311625 -2.395415 -1.292876
C  0.933351 -0.846495 -0.043713
C  0.864804 -1.917751 -1.097302
C  2.958132 0.493494 -0.631629
C  2.764326 -2.951824 1.109129
C  4.571838 -1.900415 -0.232576
C  -0.050771 -0.179341 0.568438
C  -1.495673 -0.218685 0.351126
C  2.539613 2.710239 0.483628
C  -2.290175 0.596934 1.166048
C  -2.146753 -0.982247 -0.624325
C  0.816941 3.314984 -0.544967
C  -3.665125 0.657386 1.025641
C  -3.522368 -0.932934 -0.776783
C  -4.275266 -0.112166 0.047867
H  2.371837 -3.472387 -1.453996
H  2.754469 -1.926437 -2.174934
H  0.221475 -2.734638 -0.760703
H  0.43267 -1.553267 -2.032724
H  2.857486 0.240331 -1.685721
H  4.013564 0.670841 -0.429292
H  3.286418 -2.685134 2.030003
H  1.699038 -3.029351 1.33967
H  3.104819 -3.949774 0.829336
H  5.078547 -1.466882 0.632378
H  4.976942 -2.904216 -0.37312
H  4.852698 -1.32266 -1.114792
H  0.780453 1.611531 -1.809986
H  0.242601 0.52295 1.344927
H  3.384941 2.661385 1.151362
H  -1.819294 1.204033 1.929964
H  -1.594812 -1.626394 -1.29111
H  -0.048065 3.854628 -0.89643
H  -4.249788 1.299539 1.670825
H  -3.999886 -1.532235 -1.540504
H  2.159659 -0.659585 2.228269
elementType: Cl O N C H
totalener: -1360.06836987 hartree
nucrepener: 1970.97003421 hartree
electener: -3331.03840408 hartree
oneelecener: -5749.96405312 hartree
twoeener: 2418.92564904 hartree
cpcmener: -0.10744685 hartree
kineticenergy: 1355.27968996 hartree
xcener: -109.918199906782 hartree
chargesum: 1.0000000
charge: -0.091236 -0.408844 0.093857 -0.034986 -0.356314 0.254400 0.562300 -0.271042 -0.377893 -0.103353 -0.167316 -0.362621 -0.352698 -0.092200 0.088935 0.160051 -0.173006 -0.242579 0.191450 -0.177585 -0.164406 0.125073 0.086147 0.090383 0.114033 0.095398 0.166540 0.148722 0.099963 0.113580 0.101001 0.104667 0.107410 0.092057 0.247811 0.112882 0.193300 0.140116 0.162896 0.204995 0.142871 0.140306 0.234936
qa: -0.0912 -0.4088 0.0939 -0.0350 -0.3563 0.2544 0.5623 -0.2710 -0.3779 -0.1034 -0.1673 -0.3626 -0.3527 -0.0922 0.0889 0.1601 -0.1730 -0.2426 0.1915 -0.1776 -0.1644 0.1251 0.0861 0.0904 0.1140 0.0954 0.1665 0.1487 0.1000 0.1136 0.1010 0.1047 0.1074 0.0921 0.2478 0.1129 0.1933 0.1401 0.1629 0.2050 0.1429 0.1403 0.2349
va: 1.2147 2.0567 3.3766 3.5050 3.0457 3.7471 3.6776 4.0379 3.6023 3.8701 3.8046 3.9408 3.9056 3.6622 3.6460 4.0028 3.9880 3.9995 3.9389 4.0153 4.0463 3.8215 1.0162 1.0094 0.9930 1.0068 0.9879 0.9965 1.0084 0.9931 1.0054 1.0092 1.0022 0.9995 0.9663 1.0449 0.9886 1.0081 0.9938 0.9733 1.0070 1.0099 1.0066
dispersion: -0.024561672 hartree
energy: -1360.092931541656 hartree
dipole: 36.63829 -32.68828 3.95001 -15.62513 17.03682 1.41169 -2.04443 0.08214 -1.96230
magnitude: 4.63099 au
magnitude: 11.77105 debye
