program: Orca
programVersion: 5.0.2
elementType: Cl O N N N C C C C C C C C C C C C C C C C C H H H H H H H H H H H H H H H H H H H H H
charge: 1
multiplicity: 1
keywords: wb97x-d3
keywords: def2-TZVPP
keywords: def2/J RIJCOSX
keywords: DEFGRID2
keywords: scfconv7
keywords: smallprint printgap noloewdin
keywords: NOSOSCF
formula: C17H21ClN3O
InChI: InChI=1/C17H21ClN3O/c1-16(2)8-7-14(9-13-3-5-15(18)6-4-13)17(16,22)10-21-12-19-11-20-21/h3-6,9,11-12,20,22H,7-8,10H2,1-2H3
43 atoms
Cl -5.949758 -0.051811 0.191027
O  2.671237 0.154917 -1.601104
N  2.252434 -1.748427 0.407487
N  1.133972 -2.092434 1.052864
N  1.458811 -3.57344 -0.506425
C  3.096358 1.972308 0.056332
C  2.420945 0.61636 -0.299791
C  2.323421 2.38224 1.315402
C  0.955581 0.867296 0.019247
C  0.874297 1.938799 1.070717
C  2.960492 -0.49723 0.619117
C  2.824512 2.975624 -1.067451
C  4.598441 1.884524 0.287979
C  -0.019781 0.183821 -0.588664
C  -1.462861 0.202162 -0.362302
C  2.415303 -2.658507 -0.540134
C  -2.23131 -0.737027 -1.060756
C  -2.134724 1.06357 0.512346
C  0.673479 -3.19141 0.488644
C  -3.603081 -0.825572 -0.901112
C  -3.507521 0.989388 0.680264
C  -4.234164 0.043486 -0.025365
H  2.401356 3.453543 1.503177
H  2.734089 1.880354 2.194498
H  0.267965 2.772902 0.709448
H  0.396123 1.58245 1.986543
H  2.879399 -0.242561 1.67419
H  4.007528 -0.70618 0.404176
H  3.356614 2.715021 -1.983787
H  1.763671 3.06545 -1.31237
H  3.171195 3.964496 -0.76465
H  5.11518 1.463258 -0.576748
H  5.007699 2.882179 0.455689
H  4.85608 1.285158 1.162393
H  2.172657 0.692313 -2.228107
H  0.280484 -0.532287 -1.350191
H  3.252907 -2.641054 -1.217841
H  -1.741997 -1.416907 -1.747396
H  -1.602562 1.812353 1.07792
H  -0.220626 -3.685891 0.83159
H  -4.168996 -1.562382 -1.454773
H  -4.002575 1.668433 1.361184
H  0.765978 -1.545439 1.826349
elementType: Cl O N C H
totalener: -1360.06450326 hartree
nucrepener: 1979.88371692 hartree
electener: -3339.94822018 hartree
oneelecener: -5767.46345254 hartree
twoeener: 2427.51523236 hartree
cpcmener: -0.12181920 hartree
kineticenergy: 1355.28773491 hartree
xcener: -109.920205862757 hartree
chargesum: 1.0000000
charge: -0.098960 -0.427577 0.088808 -0.029744 -0.364282 0.259467 0.561628 -0.266589 -0.378948 -0.098671 -0.150590 -0.363936 -0.353282 -0.092889 0.090128 0.154549 -0.178060 -0.244315 0.193113 -0.184205 -0.164973 0.126901 0.083979 0.091034 0.109930 0.100471 0.168227 0.147838 0.099275 0.112059 0.100089 0.103801 0.105587 0.094336 0.242091 0.121132 0.193553 0.141951 0.164634 0.205150 0.144486 0.141103 0.251702
qa: -0.0990 -0.4276 0.0888 -0.0297 -0.3643 0.2595 0.5616 -0.2666 -0.3789 -0.0987 -0.1506 -0.3639 -0.3533 -0.0929 0.0901 0.1545 -0.1781 -0.2443 0.1931 -0.1842 -0.1650 0.1269 0.0840 0.0910 0.1099 0.1005 0.1682 0.1478 0.0993 0.1121 0.1001 0.1038 0.1056 0.0943 0.2421 0.1211 0.1936 0.1420 0.1646 0.2051 0.1445 0.1411 0.2517
va: 1.2068 2.0345 3.3777 3.5095 3.0390 3.7554 3.6708 4.0384 3.6266 3.8770 3.7975 3.9409 3.9049 3.6835 3.6220 4.0066 3.9825 4.0011 3.9363 4.0193 4.0416 3.7991 1.0149 1.0093 0.9926 1.0057 0.9875 0.9973 1.0093 0.9936 1.0047 1.0089 1.0018 0.9999 0.9994 1.0387 0.9893 1.0086 0.9943 0.9741 1.0065 1.0095 0.9638
dispersion: -0.025000621 hartree
energy: -1360.089503876770 hartree
dipole: 36.72766 -32.76614 3.96152 15.86643 -17.22372 -1.35729 2.14495 -0.06558 2.07937
magnitude: 4.67543 au
magnitude: 11.88400 debye
