program: Orca
programVersion: 5.0.2
elementType: Cl O N N N C C C C C C C C C C C C C C C C C H H H H H H H H H H H H H H H H H H H H H
charge: 1
multiplicity: 1
keywords: wb97x-d3
keywords: def2-TZVPP
keywords: def2/J RIJCOSX
keywords: DEFGRID2
keywords: scfconv7
keywords: smallprint printgap noloewdin
keywords: NOSOSCF
formula: C17H21ClN3O
InChI: InChI=1/C17H21ClN3O/c1-16(2)8-7-14(9-13-3-5-15(18)6-4-13)17(16,22)10-21-12-19-11-20-21/h3-6,9,11-12,20,22H,7-8,10H2,1-2H3
43 atoms
Cl -5.939621 -0.07296 0.209314
O  2.677634 0.166975 -1.606791
N  2.240027 -1.744244 0.396846
N  1.121647 -2.081835 1.045846
N  1.423953 -3.555472 -0.52484
C  3.10494 1.973246 0.0627
C  2.425545 0.621966 -0.30345
C  2.327404 2.379821 1.320167
C  0.959891 0.87642 0.012197
C  0.87707 1.948599 1.062745
C  2.958208 -0.499038 0.610849
C  2.842518 2.983273 -1.057298
C  4.605584 1.878229 0.300919
C  -0.014888 0.192034 -0.595382
C  -1.45749 0.205795 -0.365599
C  2.389732 -2.650256 -0.556913
C  -2.218095 -0.764688 -1.02898
C  -2.134948 1.090105 0.481236
C  0.647554 -3.172489 0.476838
C  -3.588669 -0.860036 -0.863411
C  -3.506563 1.008497 0.655674
C  -4.225718 0.032775 -0.016336
H  2.41172 3.449153 1.516298
H  2.728778 1.868501 2.198115
H  0.283116 2.788532 0.694343
H  0.385145 1.597453 1.97325
H  2.88116 -0.247442 1.666941
H  4.003288 -0.714932 0.393316
H  1.783383 3.078489 -1.307415
H  3.191571 3.969331 -0.74811
H  3.378193 2.725081 -1.972263
H  5.017812 2.873262 0.476833
H  4.857066 1.272325 1.172625
H  5.124868 1.460571 -0.564024
H  2.179049 0.706861 -2.231818
H  0.285866 -0.526144 -1.354758
H  3.224036 -2.636588 -1.238845
H  -1.721935 -1.466131 -1.688863
H  -1.608027 1.863187 1.018401
H  -0.249266 -3.6607 0.82175
H  -4.148733 -1.621889 -1.388402
H  -4.006412 1.704771 1.315345
H  0.762477 -1.535778 1.824108
elementType: Cl O N C H
totalener: -1360.06453295 hartree
nucrepener: 1981.24037896 hartree
electener: -3341.30491192 hartree
oneelecener: -5770.15084013 hartree
twoeener: 2428.84592821 hartree
cpcmener: -0.12184546 hartree
kineticenergy: 1355.28661809 hartree
xcener: -109.919990504581 hartree
chargesum: 1.0000000
charge: -0.099110 -0.427515 0.087282 -0.028313 -0.364025 0.258796 0.560869 -0.264697 -0.379260 -0.101667 -0.150644 -0.364473 -0.352394 -0.090244 0.087516 0.154370 -0.178617 -0.243470 0.193338 -0.185282 -0.163997 0.127235 0.083998 0.090901 0.109976 0.101909 0.168166 0.147790 0.111843 0.100182 0.099277 0.105554 0.094410 0.103813 0.242230 0.122713 0.193324 0.141596 0.164674 0.204789 0.144663 0.141021 0.251472
qa: -0.0991 -0.4275 0.0873 -0.0283 -0.3640 0.2588 0.5609 -0.2647 -0.3793 -0.1017 -0.1506 -0.3645 -0.3524 -0.0902 0.0875 0.1544 -0.1786 -0.2435 0.1933 -0.1853 -0.1640 0.1272 0.0840 0.0909 0.1100 0.1019 0.1682 0.1478 0.1118 0.1002 0.0993 0.1056 0.0944 0.1038 0.2422 0.1227 0.1933 0.1416 0.1647 0.2048 0.1447 0.1410 0.2515
va: 1.2066 2.0345 3.3777 3.5087 3.0380 3.7567 3.6701 4.0368 3.6328 3.8798 3.7971 3.9416 3.9047 3.6910 3.6145 4.0069 3.9822 4.0009 3.9357 4.0224 4.0395 3.7990 1.0149 1.0094 0.9927 1.0055 0.9876 0.9974 0.9938 1.0047 1.0093 1.0019 1.0000 1.0089 0.9992 1.0375 0.9894 1.0090 0.9943 0.9744 1.0064 1.0095 0.9640
dispersion: -0.025085137 hartree
energy: -1360.089618088700 hartree
dipole: 36.76823 -32.82004 3.94819 15.91457 -17.26476 -1.35019 2.14549 -0.07484 2.07065
magnitude: 4.65820 au
magnitude: 11.84020 debye
