program: Orca
programVersion: 5.0.2
elementType: Cl O N N N C C C C C C C C C C C C C C C C C H H H H H H H H H H H H H H H H H H H H H
charge: 1
multiplicity: 1
keywords: wb97x-d3
keywords: def2-TZVPP
keywords: def2/J RIJCOSX
keywords: DEFGRID2
keywords: scfconv7
keywords: smallprint printgap noloewdin
keywords: NOSOSCF
formula: C17H21ClN3O
InChI: InChI=1/C17H21ClN3O/c1-16(2)8-7-14(9-13-3-5-15(18)6-4-13)17(16,22)10-21-12-19-11-20-21/h3-6,9,11-12,20,22H,7-8,10H2,1-2H3
43 atoms
Cl -6.017495 0.242999 0.000879
O  2.618454 0.066455 -1.571996
N  2.373485 -1.793575 0.475457
N  1.268326 -2.189643 1.113132
N  1.735306 -3.708649 -0.371611
C  3.000237 1.959986 0.006002
C  2.383369 0.559193 -0.2798
C  2.258675 2.3760 1.281479
C  0.919417 0.758801 0.075561
C  0.8346 1.814067 1.143246
C  2.999898 -0.494874 0.658399
C  2.632705 2.910134 -1.136855
C  4.512559 1.954006 0.179473
C  -0.05779 0.092428 -0.547559
C  -1.504167 0.159823 -0.346822
C  2.625203 -2.729685 -0.425349
C  -2.319574 -0.462323 -1.299488
C  -2.135921 0.788228 0.731735
C  0.903399 -3.344006 0.590785
C  -3.699927 -0.442407 -1.206476
C  -3.516745 0.814747 0.840432
C  -4.291243 0.205983 -0.133738
H  2.26367 3.458679 1.410812
H  2.751006 1.955289 2.161056
H  0.120435 2.588985 0.85452
H  0.478207 1.40526 2.091722
H  2.908073 -0.225038 1.70885
H  4.056464 -0.643629 0.441582
H  3.13598 2.644814 -2.068185
H  1.558914 2.943726 -1.334797
H  2.945286 3.923232 -0.881165
H  4.831656 1.392644 1.058736
H  5.016659 1.533965 -0.693264
H  4.877522 2.974804 0.304798
H  2.096141 0.574542 -2.204343
H  0.235783 -0.599009 -1.33369
H  3.476284 -2.679896 -1.084708
H  -1.86135 -0.971629 -2.138369
H  -1.56249 1.254027 1.518005
H  0.039235 -3.88747 0.936567
H  -4.302992 -0.927146 -1.96215
H  -3.980281 1.305277 1.68558
H  0.838715 -1.634923 1.848446
elementType: Cl O N C H
totalener: -1360.06493592 hartree
nucrepener: 1970.50987895 hartree
electener: -3330.57481486 hartree
oneelecener: -5748.90266011 hartree
twoeener: 2418.32784525 hartree
cpcmener: -0.12235391 hartree
kineticenergy: 1355.28900054 hartree
xcener: -109.920062685162 hartree
chargesum: 1.0000000
charge: -0.099017 -0.429395 0.094895 -0.032148 -0.366635 0.260458 0.569694 -0.274852 -0.401359 -0.103679 -0.151117 -0.362836 -0.354733 -0.061749 0.067582 0.156267 -0.173567 -0.240746 0.192621 -0.179654 -0.166982 0.125113 0.084018 0.092988 0.118832 0.096210 0.167990 0.147538 0.099260 0.113905 0.099910 0.093847 0.103407 0.106014 0.242174 0.114042 0.195385 0.140806 0.171706 0.205071 0.144369 0.141698 0.252668
qa: -0.0990 -0.4294 0.0949 -0.0321 -0.3666 0.2605 0.5697 -0.2749 -0.4014 -0.1037 -0.1511 -0.3628 -0.3547 -0.0617 0.0676 0.1563 -0.1736 -0.2407 0.1926 -0.1797 -0.1670 0.1251 0.0840 0.0930 0.1188 0.0962 0.1680 0.1475 0.0993 0.1139 0.0999 0.0938 0.1034 0.1060 0.2422 0.1140 0.1954 0.1408 0.1717 0.2051 0.1444 0.1417 0.2527
va: 1.2070 2.0337 3.3807 3.5142 3.0415 3.7532 3.6757 4.0530 3.6216 3.8658 3.8075 3.9385 3.9051 3.6399 3.6559 4.0045 3.9940 3.9852 3.9416 4.0045 4.0304 3.8042 1.0149 1.0080 0.9936 1.0096 0.9868 0.9963 1.0089 0.9932 1.0048 0.9998 1.0092 1.0015 1.0000 1.0420 0.9878 1.0075 0.9886 0.9733 1.0065 1.0094 0.9630
dispersion: -0.024531200 hartree
energy: -1360.089467115259 hartree
dipole: 36.18162 -32.06807 4.11356 14.91516 -16.45347 -1.53831 2.39884 -0.19900 2.19984
magnitude: 4.91193 au
magnitude: 12.48514 debye
