program: Orca
programVersion: 5.0.2
elementType: O O O O O O O O O O O O O N N N N N C C C C C C C C C C C C C C C C C H H H H H H H H H H H H H H H H H H H H H H H H
charge: -1
multiplicity: 1
keywords: wb97x-d3
keywords: def2-TZVPP
keywords: def2/J RIJCOSX
keywords: DEFGRID2
keywords: scfconv7
keywords: smallprint printgap noloewdin
keywords: NOSOSCF
formula: C17H24N5O13
InChI: InChI=1/C17H24N5O13/c18-6(8(25)5(24)3-34-16(19)32)13(29)20-7(15(30)31)11-9(26)10(27)14(35-11)22-1-4(2-23)12(28)21-17(22)33/h1,5-11,14,20-21,23-27H,2-3,18-19H2
59 atoms
O  1.352925 2.202598 0.795954
O  0.580215 2.884203 -2.613601
O  2.681406 3.895658 -1.45482
O  -1.874142 2.778422 -1.774821
O  -2.934818 1.036579 -0.890668
O  5.24188 1.975523 1.212344
O  -0.856429 0.415828 2.669437
O  -1.614335 -2.05537 -0.653602
O  -3.644208 -0.55394 1.250607
O  5.229609 -2.538294 1.036161
O  3.180626 -3.499205 -0.866071
O  -4.333515 -1.694407 -1.214367
O  -6.534136 -1.53649 -1.677658
N  3.307426 0.955324 0.531365
N  -0.672999 0.310074 0.406981
N  5.163086 -0.281501 1.14149
N  -1.303336 -2.273525 2.989218
N  -5.023929 -0.016268 -2.480897
C  0.36861 2.478953 -0.192101
C  1.044874 2.144877 -1.530241
C  2.502752 2.527911 -1.241042
C  2.636098 2.238423 0.26116
C  -0.907443 1.710597 0.149931
C  -1.99827 1.863406 -0.945115
C  2.665212 -0.221866 0.27372
C  4.611879 0.971478 0.979455
C  -0.857758 -0.228273 1.643927
C  -1.008762 -1.764703 1.667424
C  -2.036736 -2.340215 0.669626
C  3.227879 -1.4364 0.403545
C  -3.476042 -1.912697 1.003301
C  4.593457 -1.51264 0.871933
C  2.511988 -2.719661 0.090116
C  -4.497734 -2.432229 -0.011122
C  -5.415584 -1.097302 -1.778119
H  0.131617 3.550166 -0.181604
H  0.975601 1.061898 -1.724075
H  3.220148 1.935167 -1.82558
H  3.246731 3.003992 0.740456
H  -1.310227 2.146688 1.070702
H  -0.888815 -0.330546 -0.347565
H  -0.394814 2.979189 -2.466391
H  2.00796 4.137863 -2.107491
H  1.62836 -0.127658 -0.019558
H  -0.041452 -2.183197 1.363036
H  -2.003168 -3.428355 0.817421
H  6.118873 -0.285722 1.467725
H  -3.706006 -2.433241 1.941022
H  -0.486449 -2.162122 3.57408
H  -2.001398 -1.674278 3.414384
H  1.523554 -2.493818 -0.316447
H  2.350388 -3.281357 1.020897
H  -4.350422 -3.498004 -0.213309
H  -5.507987 -2.304092 0.379888
H  -2.374852 -1.811486 -1.195897
H  -3.388458 -0.00663 0.475707
H  4.031181 -3.737621 -0.484633
H  -4.203518 0.496593 -2.145414
H  -5.769916 0.535716 -2.864248
totalener: -1914.39159499 hartree
nucrepener: 4308.38708885 hartree
electener: -6222.77868384 hartree
twoeener: 5003.48874176 hartree
kineticenergy: 1906.97405630 hartree
xcener: -172.836982461873 hartree
chargesum: -1.0000000
charge: -0.315723 -0.445007 -0.377327 -0.485918 -0.566019 -0.396366 -0.400780 -0.391159 -0.402950 -0.431199 -0.360829 -0.320873 -0.416854 -0.054572 -0.266061 -0.161076 -0.349788 -0.327279 0.144311 0.012421 0.122918 0.151415 0.015207 0.358076 0.081970 0.338935 0.158452 0.154453 0.122027 -0.186155 0.122977 0.293658 0.068964 -0.006375 0.408017 0.101267 0.077904 0.073752 0.106877 0.087406 0.187165 0.247273 0.202105 0.071809 0.054714 0.071739 0.154711 0.077936 0.112819 0.131485 0.067468 0.081772 0.079151 0.098039 0.213888 0.235057 0.199339 0.226851 0.147983
qa: -0.3157 -0.4450 -0.3773 -0.4859 -0.5660 -0.3964 -0.4008 -0.3912 -0.4029 -0.4312 -0.3608 -0.3209 -0.4169 -0.0546 -0.2661 -0.1611 -0.3498 -0.3273 0.1443 0.0124 0.1229 0.1514 0.0152 0.3581 0.0820 0.3389 0.1585 0.1545 0.1220 -0.1862 0.1230 0.2937 0.0690 -0.0064 0.4080 0.1013 0.0779 0.0738 0.1069 0.0874 0.1872 0.2473 0.2021 0.0718 0.0547 0.0717 0.1547 0.0779 0.1128 0.1315 0.0675 0.0818 0.0792 0.0980 0.2139 0.2351 0.1993 0.2269 0.1480
va: 2.0635 1.9949 2.0930 1.9882 1.9317 2.1262 2.1233 2.0492 2.0628 2.0933 2.0303 2.0207 2.1018 3.1752 3.0987 3.1849 3.1370 3.1461 3.8619 4.0253 4.0082 3.7847 3.7758 4.3626 3.9850 4.3758 4.4052 3.8604 3.8649 3.5161 3.9667 4.2936 3.9743 3.8469 4.4328 1.0265 1.0084 1.0178 1.0443 1.0527 1.0577 1.0855 1.0730 1.0828 1.0332 1.0299 1.0397 1.0204 1.0427 1.0408 1.0149 0.9787 1.0019 1.0262 1.0692 1.0925 1.0513 1.0650 1.0313
dispersion: -0.041490249 hartree
energy: -1914.433085235081 hartree
dipole: -10.56902 11.86753 1.29851 -9.43187 8.43249 -0.99939 0.41213 0.09397 0.50610
magnitude: 1.71494 au
magnitude: 4.35904 debye
