program: Orca
programVersion: 5.0.2
elementType: O O O O O O O O O O O O O N N N N N C C C C C C C C C C C C C C C C C H H H H H H H H H H H H H H H H H H H H H H H H
charge: -1
multiplicity: 1
keywords: wb97x-d3
keywords: def2-TZVPP
keywords: def2/J RIJCOSX
keywords: DEFGRID2
keywords: scfconv7
keywords: smallprint printgap noloewdin
keywords: NOSOSCF
formula: C17H24N5O13
InChI: InChI=1/C17H24N5O13/c18-6(8(25)5(24)3-34-16(19)32)13(29)20-7(15(30)31)11-9(26)10(27)14(35-11)22-1-4(2-23)12(28)21-17(22)33/h1,5-11,14,20-21,23-27H,2-3,18-19H2
59 atoms
O  0.847301 2.423021 0.51628
O  1.135033 4.787463 -1.384219
O  3.572632 3.89308 -1.086094
O  -0.148905 -0.84288 -1.330756
O  1.28395 0.503776 -2.364452
O  4.895677 1.998329 0.660654
O  -3.368186 1.565396 -1.777359
O  -5.270214 -0.913669 1.311178
O  -2.466803 -1.345283 1.74969
O  4.445111 -2.432264 1.465436
O  0.202847 -2.040608 1.042963
O  -2.48358 -3.956799 0.499918
O  -2.101354 -3.743937 -1.714736
N  2.788795 1.160282 0.811057
N  -1.632373 1.209614 -0.369839
N  4.621196 -0.206105 1.107264
N  -5.116495 1.604688 0.449739
N  -0.740139 -4.984498 -0.390029
C  0.207898 2.728617 -0.729229
C  1.278134 3.399389 -1.585807
C  2.603812 2.88669 -1.005362
C  2.229455 2.486975 0.440854
C  -0.56229 1.525023 -1.28781
C  0.275081 0.282882 -1.681766
C  1.990933 0.074351 1.012835
C  4.149987 1.048997 0.847429
C  -2.935086 1.237304 -0.678663
C  -3.885367 0.837069 0.448438
C  -4.284457 -0.649816 0.344011
C  2.457238 -1.170937 1.209681
C  -3.112597 -1.603543 0.522799
C  3.883646 -1.36693 1.272822
C  1.541137 -2.361757 1.31307
C  -3.58566 -3.049751 0.444155
C  -1.791412 -4.179355 -0.624037
H  -0.555643 3.479894 -0.509616
H  1.185644 3.141549 -2.644933
H  2.906457 1.99304 -1.555114
H  2.608346 3.212206 1.167338
H  -1.028265 1.879877 -2.212075
H  -1.37699 0.860983 0.542625
H  1.93368 5.223523 -1.7016
H  4.38554 3.540959 -0.702996
H  0.933316 0.273693 1.018607
H  -3.399369 0.994382 1.414012
H  -4.679941 -0.816594 -0.671765
H  5.630826 -0.297211 1.138751
H  -2.436835 -1.421754 -0.319738
H  -4.957588 2.533328 0.81836
H  -5.4580 1.716932 -0.49846
H  1.581445 -2.789195 2.318373
H  1.906638 -3.141453 0.632377
H  -4.197367 -3.304204 1.309126
H  -4.183355 -3.217726 -0.454382
H  -5.803163 -0.101022 1.343006
H  -1.542697 -1.630138 1.67815
H  0.125985 -1.672066 0.13218
H  -0.431827 -5.168671 0.550705
H  -0.067884 -5.115026 -1.127293
elementType: O N C H
totalener: -1914.48900391 hartree
nucrepener: 4340.86617902 hartree
electener: -6255.35518293 hartree
twoeener: 5039.48221942 hartree
cpcmener: -0.13949783 hartree
kineticenergy: 1906.82012787 hartree
xcener: -172.826162912701 hartree
chargesum: -1.0000000
charge: -0.373778 -0.420863 -0.427373 -0.579093 -0.556207 -0.523840 -0.534335 -0.449396 -0.465340 -0.487700 -0.463540 -0.315546 -0.510197 -0.048115 -0.178702 -0.122706 -0.390543 -0.286195 0.158364 0.155543 0.031826 0.149610 0.017998 0.314221 -0.023805 0.407771 0.226037 0.129375 0.141685 -0.096801 0.144067 0.281699 0.064554 -0.029345 0.455844 0.087600 0.096530 0.116102 0.121387 0.091467 0.175316 0.228842 0.246914 0.154972 0.093918 0.097216 0.183332 0.068757 0.142893 0.152010 0.097381 0.092147 0.111371 0.110039 0.228813 0.242662 0.269744 0.198060 0.197351
qa: -0.3738 -0.4209 -0.4274 -0.5791 -0.5562 -0.5238 -0.5343 -0.4494 -0.4653 -0.4877 -0.4635 -0.3155 -0.5102 -0.0481 -0.1787 -0.1227 -0.3905 -0.2862 0.1584 0.1555 0.0318 0.1496 0.0180 0.3142 -0.0238 0.4078 0.2260 0.1294 0.1417 -0.0968 0.1441 0.2817 0.0646 -0.0293 0.4558 0.0876 0.0965 0.1161 0.1214 0.0915 0.1753 0.2288 0.2469 0.1550 0.0939 0.0972 0.1833 0.0688 0.1429 0.1520 0.0974 0.0921 0.1114 0.1100 0.2288 0.2427 0.2697 0.1981 0.1974
va: 2.0229 2.0147 2.0010 1.8450 1.9008 1.9830 1.9800 1.9868 1.9618 2.0457 1.9686 2.0651 1.9924 3.2356 3.2020 3.2158 3.0519 3.2089 3.8754 3.9686 3.9463 3.8648 3.6233 4.4913 4.0172 4.3202 4.2863 3.8987 3.8547 3.5059 3.7590 4.3702 3.9558 3.9586 4.4180 1.0324 1.0333 1.0439 1.0164 1.0593 1.0240 1.0221 1.0205 1.0209 1.0490 1.0108 1.0190 1.0415 1.0211 1.0343 0.9909 0.9895 1.0236 1.0200 1.0486 1.0595 1.0181 1.0049 1.0039
dispersion: -0.042602869 hartree
energy: -1914.531606781973 hartree
dipole: -15.69056 16.56577 0.87521 -0.15805 1.52819 1.37014 2.03927 0.73394 2.77321
magnitude: 3.21465 au
magnitude: 8.17099 debye
