program: Orca
programVersion: 5.0.2
elementType: O O O O O O O O O O O O O N N N N N C C C C C C C C C C C C C C C C C H H H H H H H H H H H H H H H H H H H H H H H H
charge: -1
multiplicity: 1
keywords: wb97x-d3
keywords: def2-TZVPP
keywords: def2/J RIJCOSX
keywords: DEFGRID2
keywords: scfconv7
keywords: smallprint printgap noloewdin
keywords: NOSOSCF
formula: C17H24N5O13
InChI: InChI=1/C16H24N5O11.CO2/c17-9(10(25)8(24)5-32-15(18)30)13(28)19-2-1-7(23)11(26)14(29)21-3-6(4-22)12(27)20-16(21)31;2-1-3/h1-3,7-11,14,19-20,22-26H,4-5,17-18H2;
59 atoms
O  -1.471374 2.153449 -0.251323
O  -3.999402 2.275971 1.559726
O  -4.838563 1.096839 -0.930967
O  2.469054 1.200226 -1.00147
O  4.029185 -0.29189 -1.825924
O  -3.666031 1.645201 -3.657738
O  -0.370915 -3.059216 1.480609
O  2.801273 -2.236832 0.706978
O  4.565009 -0.353116 1.396099
O  -0.647432 -1.309974 -5.27062
O  0.93972 -1.791306 -1.348912
O  2.818563 1.546491 2.459861
O  0.79221 1.462751 3.460203
N  -1.966566 1.011958 -2.27516
N  -0.684957 -0.993717 2.364401
N  -2.084579 0.228243 -4.438854
N  1.998417 -3.33164 3.084939
N  1.188929 2.832285 1.699738
C  -2.430139 0.538764 1.838653
C  -3.688317 0.962413 1.137848
C  -3.553525 0.853408 -0.380822
C  -2.482064 1.818399 -0.991904
C  -1.89931 -0.677868 1.753579
C  3.248538 0.447178 -1.402093
C  -0.921869 0.177551 -2.068774
C  -2.636374 1.005869 -3.451724
C  0.041715 -2.103339 2.13062
C  1.449744 -2.04928 2.718939
C  2.370129 -1.334063 1.703404
C  -0.429956 -0.667397 -3.000691
C  3.622615 -0.744092 2.372402
C  -1.017814 -0.638661 -4.312254
C  0.682327 -1.640268 -2.729305
C  3.34415 0.469343 3.238785
C  1.537383 1.902647 2.59675
H  -1.922252 1.295559 2.427995
H  -4.502749 0.278516 1.423032
H  -3.258191 -0.187469 -0.578151
H  -3.028561 2.658758 -1.468565
H  -2.354634 -1.47805 1.184871
H  -0.230732 -0.243141 2.874785
H  -4.797882 2.550178 1.096308
H  -4.736551 1.344759 -1.859406
H  -0.508293 0.233965 -1.069726
H  1.401028 -1.438759 3.623473
H  1.810738 -0.516661 1.233765
H  -2.558363 0.246386 -5.335149
H  4.050044 -1.502116 3.044367
H  1.407154 -3.759604 3.785985
H  1.986863 -3.94908 2.28335
H  1.61457 -1.305861 -3.189346
H  0.441215 -2.60591 -3.186395
H  2.688452 0.2151 4.069637
H  4.281853 0.8275 3.66548
H  2.242579 -2.12546 -0.079592
H  4.648014 -1.087652 0.776178
H  0.171028 -2.199269 -0.931593
H  1.794345 3.043377 0.922893
H  0.211292 3.0489 1.591645
elementType: O N C H
totalener: -1914.46631453 hartree
nucrepener: 4296.49246118 hartree
electener: -6210.95877570 hartree
twoeener: 4994.22793083 hartree
cpcmener: -0.16112801 hartree
kineticenergy: 1906.75152256 hartree
xcener: -172.700891108191 hartree
chargesum: -1.0000000
charge: -0.788946 -0.443600 -0.471082 -0.254727 -0.253391 -0.568315 -0.559901 -0.505426 -0.449921 -0.544449 -0.410933 -0.315108 -0.553021 -0.078827 -0.185924 -0.124260 -0.408973 -0.288023 -0.173054 0.207455 0.110988 0.088083 -0.077380 0.500646 0.038165 0.415404 0.269722 0.137247 0.148737 -0.125730 0.181753 0.302168 0.037931 -0.030279 0.493531 0.089221 0.103324 0.082608 0.098427 0.120919 0.225479 0.231615 0.249039 0.093769 0.114411 0.083194 0.182999 0.087124 0.144589 0.140025 0.105905 0.120689 0.110067 0.125707 0.260670 0.242382 0.248701 0.207733 0.210845
qa: -0.7889 -0.4436 -0.4711 -0.2547 -0.2534 -0.5683 -0.5599 -0.5054 -0.4499 -0.5444 -0.4109 -0.3151 -0.5530 -0.0788 -0.1859 -0.1243 -0.4090 -0.2880 -0.1731 0.2075 0.1110 0.0881 -0.0774 0.5006 0.0382 0.4154 0.2697 0.1372 0.1487 -0.1257 0.1818 0.3022 0.0379 -0.0303 0.4935 0.0892 0.1033 0.0826 0.0984 0.1209 0.2255 0.2316 0.2490 0.0938 0.1144 0.0832 0.1830 0.0871 0.1446 0.1400 0.1059 0.1207 0.1101 0.1257 0.2607 0.2424 0.2487 0.2077 0.2108
va: 1.6335 1.9791 1.9631 2.3084 2.3141 1.9263 1.9407 1.9361 1.9913 1.9754 2.0028 2.0772 1.9343 3.1252 3.2101 3.2101 3.0787 3.2351 3.8806 3.8634 3.7394 4.1264 3.9283 4.2494 4.0381 4.3209 4.1914 3.9147 3.7951 3.5333 3.8581 4.3537 3.8932 3.8550 4.3519 1.0529 1.0145 1.0099 1.0267 1.0444 1.0077 1.0129 1.0267 1.0612 1.0269 1.0260 1.0196 1.0379 1.0195 1.0466 0.9923 0.9970 1.0222 1.0053 1.0522 1.0141 0.9952 1.0026 1.0113
dispersion: -0.043538283 hartree
energy: -1914.509852808231 hartree
dipole: 0.80819 1.62492 2.43310 -6.52529 4.87657 -1.64872 15.93440 -14.55477 1.37963
magnitude: 3.24679 au
magnitude: 8.25269 debye
