program: Gaussian 09
title: 000070864
version: EM64L-G09RevD.01
frameworkgroup: C1[X(C17H25NO2)]
method: RPBEPBE
basis: SDD
operation: Freq
keyword: #p
keyword: freq=noraman
keyword: PBEPBE/SDD
title: #p freq=noraman PBEPBE/SDD
converged: YES YES NO NO
title: Mulliken charges:
elementType: O O N C C C C C C C C C C C C C C C C C H H H H H H H H H H H H H H H H H H H H H H H H H
charge: -0.232076 -0.256753 -0.075096 -0.366448 -0.345079 -0.392489 -0.399883 -0.397306 -0.353846 -0.535320 0.100359 0.290847 -0.342894 -0.336049 0.343845 -0.372033 -0.380250 -0.258091 -0.394273 -0.677118 0.214975 0.167456 0.168519 0.200931 0.191424 0.202972 0.202572 0.189985 0.189099 0.212269 0.194001 0.232802 0.249501 0.232836 0.245425 0.279248 0.247740 0.254860 0.205285 0.205602 0.220735 0.220830 0.210436 0.229948 0.210501
chargesum: 0.00000
title: Mulliken charges with hydrogens summed into heavy atoms:
elementType: O O N C C C C C C C C C C C C C C C C C
charge: -0.232076 -0.256753 -0.075096 0.015983 0.024371 0.001907 -0.007327 0.004062 0.072957 -0.052984 0.100359 0.290847 -0.097469 -0.056800 0.343845 -0.124293 -0.125390 0.152796 0.047292 -0.026233
polarizability: 3.02489778e+02 1.71909779e+01 1.94036462e+02 1.06853136e+00 -5.17694653e-01 1.27470880e+02
1716.lowfreq: -6.9255 -5.4611 -0.0010 0.0008 0.0014 4.7627 20.8243 26.4197 34.0303
frequency: 19.8679 24.8268 33.7140 36.5500 60.1819 76.4722 83.2285 92.3722 117.2840 138.2003 153.8660 172.6487 197.9517 225.2120 230.5135 255.8193 277.0664 284.3729 303.5837 332.6323 383.3118 414.3549 417.8631 442.0076 450.0396 473.2366 488.9467 499.5212 546.3477 571.5739 620.8569 630.1209 727.0804 733.3174 767.0943 782.4417 791.8685 804.3274 815.2097 821.1479 850.3827 856.8393 857.1456 894.9709 902.2788 906.7130 949.6313 958.2551 967.9901 979.8878 996.0595 996.9975 1006.3181 1029.9777 1049.5455 1053.1613 1068.8026 1093.7046 1108.7010 1116.1013 1122.8874 1135.9172 1141.0760 1150.7498 1154.9381 1169.8632 1178.0143 1208.5330 1230.5291 1233.6282 1243.4347 1258.6545 1264.7960 1284.1145 1287.7186 1294.9686 1301.8897 1307.7737 1310.3526 1329.9211 1340.1193 1343.7511 1348.7272 1369.0328 1371.7474 1383.4056 1392.2897 1395.6886 1430.0602 1436.1704 1451.5428 1459.3687 1460.7232 1464.7255 1468.6080 1472.0961 1478.9181 1479.4544 1480.9447 1489.0678 1499.2039 1554.1479 1589.8426 1618.7232 2813.3409 2825.3406 2877.3892 2951.0666 2967.0096 2973.6547 2979.1444 2983.2871 2984.5326 3005.8052 3010.5275 3022.0030 3022.2804 3027.5950 3034.0481 3043.9722 3052.7350 3053.4725 3053.7588 3082.0606 3085.4830 3141.2716 3150.5247 3166.6369 3171.6140
redmass: 3.0331 3.2259 3.9101 4.5369 3.4264 2.3696 3.5877 2.5819 3.0183 2.8156 3.2622 5.1848 2.8747 1.1260 1.8487 4.7427 3.7731 5.2362 2.0867 3.7282 1.8269 2.9657 3.8914 3.4479 3.0159 4.3664 3.0161 3.8980 1.9108 2.1671 6.0902 6.6631 4.2994 3.0024 1.0883 2.9600 1.8324 1.6436 1.9200 2.1204 1.4021 2.7750 1.5332 1.1506 1.7541 2.3337 1.3707 1.3246 4.2742 5.0967 2.8165 1.3687 2.4218 1.9404 2.1581 2.7978 1.7740 1.9822 2.1402 1.3286 2.4550 2.1749 1.4473 1.2917 2.4744 1.2595 1.3226 1.7013 1.2688 3.0343 2.1319 1.2538 1.1829 1.2186 1.1045 1.3702 1.3629 1.8528 1.3915 1.2845 1.4272 1.5138 1.4943 1.6402 2.0507 1.9100 1.4779 1.2531 4.1830 1.1080 1.0902 1.0882 1.0879 1.0910 1.0836 1.0901 1.0954 1.0961 1.0419 1.1638 2.0840 7.1968 8.2457 6.3246 1.0715 1.0702 1.0710 1.0551 1.0618 1.0595 1.0364 1.0614 1.0613 1.0601 1.1064 1.0941 1.0880 1.0903 1.0936 1.1033 1.0923 1.1020 1.1016 1.1031 1.0987 1.0879 1.0880 1.0949 1.0971
irintensity: 0.3400 0.6902 0.3601 0.6593 0.2716 0.0178 1.2023 1.6716 0.3555 0.2670 5.5061 0.7783 6.2720 0.1044 0.7184 3.8592 3.4670 0.6629 4.0514 6.9635 2.3206 0.0542 7.2577 0.5502 0.2213 0.6784 5.8036 5.6613 7.4985 10.1081 25.0443 8.0279 6.0299 0.6389 13.9742 1.4233 23.0097 2.0029 14.0000 6.3608 4.4785 6.2331 47.5742 2.5893 4.3347 8.5910 0.6155 11.0870 172.6909 30.7414 2.0879 0.2453 3.4706 9.1027 8.7592 7.0745 4.1970 1.3721 54.4808 14.6919 2.1226 7.2579 0.2745 10.4153 46.4509 19.8328 241.4638 20.5618 2.1799 232.3943 98.2862 11.7875 6.4405 10.5993 0.0163 9.7435 6.8056 154.4542 11.4043 16.1575 0.4404 39.7896 5.9607 5.9007 25.9226 0.8052 9.7891 21.4913 50.5622 14.0326 7.5718 10.3599 7.9913 8.1426 5.6761 15.9222 4.2959 8.5150 14.0550 37.4334 12.7662 201.9205 96.7269 173.6192 51.5165 142.7537 95.3081 30.5654 39.4735 30.9148 36.7992 33.1389 35.6444 23.3384 24.6082 20.6524 59.1826 72.6037 27.4066 20.4100 24.7164 109.0958 0.1360 81.2814 42.9604 12.8761 0.1234 13.5618 7.6204
temp: 298.150 k
press: 1.00000 atm
elementType: 8 8 7 6 6 6 6 6 6 6 6 6 6 6 6 6 6 6 6 6 1 1 1 1 1 1 1 1 1 1 1 1 1 1 1 1 1 1 1 1 1 1 1 1 1
symmnumber: 1
zpe: 1015672.4 jmol-1
zpe.correction: 0.386849 hartree
zpe.thermalcorrener: 0.407464 hartree
zpe.thermalcorrenthalpy: 0.408408 hartree
zpe.thermalcorrgfe: 0.334522 hartree
zpe.sumelectzpe: -866.450906 hartree
zpe.sumelectthermal: -866.430292 hartree
zpe.sumelectthermalent: -866.429348 hartree
zpe.sumelectthermalfe: -866.503234 hartree
dipole: -2.3864 -4.4354 -0.2694
dipole: 5.0439
quadrupole: -98.8445 -125.5999 -123.3790
quadrupole: 6.0274 -2.2647 1.1266
quadrupole: 17.0966 -9.6588 -7.4378 6.0274 -2.2647 1.1266
hfenergy: -866.8377553 hartree
pointgroup: C01 [X(C17H25N1O2)]
dipole: 0.914634 1.7551456 -0.1441761 debye
polarizability: 301.8503417|18.9630759|194.5773253|3.2978153|-1.4215186|127.5694531 unknown
InChI: InChI=1S/C17H25NO2/c1-2-14-20-16-8-6-15(7-9-16)17(19)10-13-18-11-4-3-5-12-18/h6-9H,2-5,10-14H2,1H3
charge 0 multiplicity 1
45 atoms
O  -0.936171 -2.700727 -0.004431
O  4.975644 -0.20165 0.215579
N  -4.133954 0.108598 0.149428
C  -5.449573 -0.490472 0.501076
C  -4.266894 1.056897 -0.98748
C  -6.47607 0.596293 0.879528
C  -5.258898 2.191568 -0.660434
C  -6.638963 1.617467 -0.2687
C  -3.108649 -0.938213 -0.091863
C  -1.677718 -0.376315 -0.018198
C  -0.608311 -1.473823 0.009408
C  0.832728 -1.071793 0.060694
C  1.255805 0.281921 0.114625
C  1.828808 -2.092537 0.060758
C  3.597179 -0.412647 0.165365
C  2.623223 0.620522 0.167332
C  3.190999 -1.77388 0.110867
C  5.472363 1.189278 0.281867
C  6.999933 1.119226 0.33515
C  7.629505 2.5275 0.410454
H  -5.296755 -1.181181 1.351326
H  -5.858237 -1.097744 -0.351181
H  -4.61219 0.521743 -1.913854
H  -3.273483 1.486747 -1.212057
H  -7.445455 0.118351 1.119713
H  -6.122162 1.117038 1.790449
H  -4.85436 2.78656 0.181318
H  -5.348363 2.863902 -1.535715
H  -7.090296 1.112672 -1.148146
H  -7.329074 2.43028 0.027361
H  -3.258434 -1.458933 -1.070313
H  -3.215389 -1.713658 0.687429
H  -1.593316 0.244589 0.896923
H  -1.466075 0.301283 -0.869228
H  0.516868 1.090069 0.120195
H  1.494528 -3.134449 0.021248
H  2.917286 1.673025 0.210402
H  3.962698 -2.54949 0.110956
H  5.129478 1.746979 -0.614526
H  5.065005 1.684223 1.188018
H  7.364637 0.583159 -0.560548
H  7.298905 0.518016 1.21375
H  7.363636 3.137158 -0.473524
H  8.73069 2.459791 0.451471
H  7.293272 3.07286 1.312304
