program: Orca
programVersion: 5.0.2
elementType: O O O O O O O O O O O O O N N N N N C C C C C C C C C C C C C C C C C H H H H H H H H H H H H H H H H H H H H H H H H
charge: -1
multiplicity: 1
keywords: wb97x-d3
keywords: def2-TZVPP
keywords: def2/J RIJCOSX
keywords: DEFGRID2
keywords: scfconv7
keywords: smallprint printgap noloewdin
keywords: NOSOSCF
formula: C17H24N5O13
InChI: InChI=1/C17H24N5O13/c18-6(8(25)5(24)3-34-16(19)32)13(29)20-7(15(30)31)11-9(26)10(27)14(35-11)22-1-4(2-23)12(28)21-17(22)33/h1,5-11,14,20-21,23-27H,2-3,18-19H2
59 atoms
O  1.724583 1.398445 1.313711
O  0.274478 3.648005 -1.04485
O  2.572733 4.155996 0.123966
O  -1.903792 3.116771 0.261244
O  -3.010795 1.25089 0.724676
O  5.573078 1.806466 0.223189
O  -0.221033 -1.470874 1.950013
O  -2.502824 -1.058657 -1.53007
O  -3.353599 -1.354032 1.494265
O  5.649247 -2.429726 -1.361726
O  3.002437 -3.22461 -2.408575
O  -5.098151 -0.585373 -0.580017
O  -7.185539 -0.253282 0.206858
N  3.585974 0.688449 0.108237
N  -0.579409 -0.038801 0.220807
N  5.56122 -0.319511 -0.552072
N  -1.06598 -3.696618 0.567021
N  -5.724879 1.480289 -0.106603
C  0.571546 2.085153 0.835833
C  0.956405 2.528844 -0.580566
C  2.442507 2.865697 -0.392312
C  2.872429 1.852733 0.677434
C  -0.650522 1.188531 0.988575
C  -1.96712 1.931498 0.625071
C  2.928239 -0.454571 -0.241015
C  4.950146 0.807326 -0.049004
C  -0.608326 -1.264669 0.821584
C  -1.108402 -2.407452 -0.085568
C  -2.519712 -2.18711 -0.677138
C  3.541331 -1.547197 -0.734904
C  -3.611027 -2.180253 0.404972
C  4.973564 -1.516099 -0.921032
C  2.820851 -2.818021 -1.077722
C  -5.009667 -1.942141 -0.168669
C  -6.1073 0.187054 -0.106467
H  0.404979 2.977022 1.452702
H  0.860885 1.672634 -1.268464
H  3.02426 2.742707 -1.315629
H  3.561897 2.31982 1.38363
H  -0.714493 0.905661 2.04438
H  -1.059618 -0.026553 -0.670855
H  -0.622094 3.612064 -0.621959
H  1.794284 4.6331 -0.198839
H  1.858778 -0.436007 -0.081332
H  -0.442614 -2.447266 -0.957298
H  -2.70939 -3.079642 -1.288952
H  6.561201 -0.245311 -0.672807
H  -3.623727 -3.208621 0.78643
H  -0.109546 -4.020047 0.615894
H  -1.350134 -3.57623 1.53233
H  1.74943 -2.671815 -0.930247
H  3.129577 -3.603802 -0.37486
H  -5.199425 -2.593059 -1.027978
H  -5.763504 -2.160616 0.588987
H  -3.26454 -0.495949 -1.348132
H  -3.234933 -0.416828 1.223188
H  3.944886 -3.382691 -2.521817
H  -4.733882 1.674782 0.056201
H  -6.378308 2.116571 0.313607
totalener: -1914.39293556 hartree
nucrepener: 4268.37558106 hartree
electener: -6182.76851662 hartree
twoeener: 4963.45311688 hartree
kineticenergy: 1906.95586504 hartree
xcener: -172.831363733471 hartree
chargesum: -1.0000000
charge: -0.325346 -0.447448 -0.371882 -0.484166 -0.566344 -0.392912 -0.381850 -0.401068 -0.401580 -0.435058 -0.360879 -0.322010 -0.418681 -0.059246 -0.241131 -0.160095 -0.342328 -0.323842 0.160914 0.017573 0.139910 0.122987 0.028894 0.350623 0.138979 0.327749 0.100974 0.110368 0.123562 -0.238541 0.113658 0.301625 0.120154 0.001848 0.412874 0.104838 0.070836 0.072480 0.102115 0.089796 0.181793 0.248415 0.199797 0.061410 0.115444 0.070008 0.154504 0.078118 0.112450 0.137694 0.018523 0.085300 0.075338 0.097773 0.222328 0.233929 0.201456 0.221301 0.146068
qa: -0.3253 -0.4474 -0.3719 -0.4842 -0.5663 -0.3929 -0.3819 -0.4011 -0.4016 -0.4351 -0.3609 -0.3220 -0.4187 -0.0592 -0.2411 -0.1601 -0.3423 -0.3238 0.1609 0.0176 0.1399 0.1230 0.0289 0.3506 0.1390 0.3277 0.1010 0.1104 0.1236 -0.2385 0.1137 0.3016 0.1202 0.0018 0.4129 0.1048 0.0708 0.0725 0.1021 0.0898 0.1818 0.2484 0.1998 0.0614 0.1154 0.0700 0.1545 0.0781 0.1124 0.1377 0.0185 0.0853 0.0753 0.0978 0.2223 0.2339 0.2015 0.2213 0.1461
va: 2.0531 1.9954 2.1017 1.9857 1.9444 2.1228 2.1295 2.0438 2.0639 2.0891 2.0326 2.0248 2.1006 3.1969 3.0666 3.1901 3.1292 3.1430 3.8017 4.0647 3.9417 3.8184 3.8103 4.3460 3.9481 4.3907 4.4227 3.7767 3.9070 3.6252 3.9637 4.2806 4.0343 3.8459 4.4302 1.0322 1.0192 1.0182 1.0377 1.0564 1.0497 1.0856 1.0737 1.0810 1.0000 1.0306 1.0395 1.0209 1.0446 1.0392 0.9886 0.9869 1.0019 1.0271 1.0634 1.0962 1.0526 1.0661 1.0323
dispersion: -0.041126247 hartree
energy: -1914.434061802779 hartree
dipole: -11.36687 12.89515 1.52827 -9.46411 8.55537 -0.90873 -2.26985 1.91242 -0.35744
magnitude: 1.81361 au
magnitude: 4.60983 debye
