program: Orca
programVersion: 5.0.2
elementType: O O O O O O O O O O O O O N N N N N C C C C C C C C C C C C C C C C C H H H H H H H H H H H H H H H H H H H H H H H H
charge: -1
multiplicity: 1
keywords: wb97x-d3
keywords: def2-TZVPP
keywords: def2/J RIJCOSX
keywords: DEFGRID2
keywords: scfconv7
keywords: smallprint printgap noloewdin
keywords: NOSOSCF
formula: C17H24N5O13
InChI: InChI=1/C17H24N5O13/c18-6(8(25)5(24)3-34-16(19)32)13(29)20-7(15(30)31)11-9(26)10(27)14(35-11)22-1-4(2-23)12(28)21-17(22)33/h1,5-11,14,20-21,23-27H,2-3,18-19H2
59 atoms
O  0.842098 2.224721 0.515235
O  1.101711 4.6562 -1.421811
O  3.505539 3.759283 -1.176985
O  -0.206568 -0.898386 -0.880894
O  1.232768 0.297653 -2.105286
O  4.902164 2.190044 0.703459
O  -3.42432 2.074969 -1.626149
O  -5.431543 -0.862485 1.127255
O  -2.462423 -1.103011 1.502357
O  4.909657 -2.246357 1.566715
O  0.677463 -2.406808 1.016682
O  -2.533229 -3.759698 0.570776
O  -2.746662 -4.5049 -1.552098
N  2.88427 1.140235 0.843613
N  -1.773281 1.168859 -0.356913
N  4.841357 -0.012199 1.216079
N  -5.311978 1.690574 0.355956
N  -0.790799 -4.716444 -0.393982
C  0.151941 2.603194 -0.687314
C  1.196966 3.262294 -1.588215
C  2.538448 2.750459 -1.050681
C  2.207508 2.391728 0.414294
C  -0.655923 1.421422 -1.234392
C  0.210101 0.147422 -1.439102
C  2.202218 -0.034356 1.006111
C  4.246982 1.177846 0.904843
C  -3.050433 1.45694 -0.642228
C  -4.05904 0.952082 0.397395
C  -4.416684 -0.540386 0.216531
C  2.797587 -1.219296 1.222203
C  -3.229871 -1.48243 0.377615
C  4.235329 -1.261234 1.352123
C  2.045357 -2.5237 1.259174
C  -3.686835 -2.929851 0.500838
C  -2.080889 -4.32548 -0.563155
H  -0.571926 3.375009 -0.411492
H  1.063013 2.975508 -2.636503
H  2.81542 1.842541 -1.590248
H  2.550232 3.181071 1.094369
H  -1.055661 1.728779 -2.204895
H  -1.61145 0.538777 0.417253
H  2.004711 4.994062 -1.440488
H  4.261149 3.488024 -0.638362
H  1.131305 0.047256 0.944138
H  -3.6353 1.063159 1.398461
H  -4.771641 -0.672122 -0.821335
H  5.849863 0.006458 1.263966
H  -2.626075 -1.394728 -0.53452
H  -5.203889 2.579967 0.823652
H  -5.518557 1.910291 -0.612924
H  2.170384 -2.993271 2.239464
H  2.534127 -3.199157 0.541579
H  -4.233327 -3.080872 1.430537
H  -4.329308 -3.215172 -0.334159
H  -5.985098 -0.066409 1.150642
H  -1.642831 -1.611215 1.488435
H  0.493096 -1.90869 0.172535
H  -0.234275 -4.17488 0.256486
H  -0.320387 -4.975575 -1.243348
totalener: -1914.39402441 hartree
nucrepener: 4310.10871944 hartree
electener: -6224.50274385 hartree
twoeener: 5006.76961134 hartree
kineticenergy: 1906.95716558 hartree
xcener: -172.831335099462 hartree
chargesum: -1.0000000
charge: -0.347689 -0.377122 -0.401464 -0.551434 -0.466930 -0.480714 -0.445623 -0.379357 -0.390217 -0.389955 -0.461879 -0.306607 -0.416477 -0.068401 -0.204669 -0.153212 -0.362037 -0.310497 0.108488 0.146154 0.028993 0.139876 0.057455 0.294906 0.035228 0.382845 0.192639 0.057496 0.121415 -0.124589 0.124794 0.235752 0.108513 -0.001590 0.419739 0.076115 0.080503 0.120292 0.102497 0.080107 0.187584 0.195668 0.224108 0.109004 0.095175 0.076441 0.152273 0.105859 0.115974 0.138815 0.071552 0.075898 0.095373 0.093812 0.189394 0.205698 0.244231 0.197349 0.152452
qa: -0.3477 -0.3771 -0.4015 -0.5514 -0.4669 -0.4807 -0.4456 -0.3794 -0.3902 -0.3900 -0.4619 -0.3066 -0.4165 -0.0684 -0.2047 -0.1532 -0.3620 -0.3105 0.1085 0.1462 0.0290 0.1399 0.0575 0.2949 0.0352 0.3828 0.1926 0.0575 0.1214 -0.1246 0.1248 0.2358 0.1085 -0.0016 0.4197 0.0761 0.0805 0.1203 0.1025 0.0801 0.1876 0.1957 0.2241 0.1090 0.0952 0.0764 0.1523 0.1059 0.1160 0.1388 0.0716 0.0759 0.0954 0.0938 0.1894 0.2057 0.2442 0.1973 0.1525
va: 2.0427 2.0719 2.0207 1.8795 2.0062 2.0291 2.0689 2.0427 2.0233 2.1519 1.9694 2.0583 2.1016 3.2187 3.1829 3.1813 3.0521 3.1538 3.8871 4.0377 3.9714 3.9222 3.6185 4.4764 4.0029 4.3324 4.3293 3.9258 3.8641 3.5531 3.7970 4.3870 4.0007 3.9702 4.4411 1.0359 1.0351 1.0466 1.0173 1.0548 1.0431 1.0704 1.0553 1.0721 1.0421 1.0086 1.0411 1.0174 1.0362 1.0494 0.9922 0.9873 1.0197 1.0364 1.0831 1.0639 1.0610 1.0547 1.0292
dispersion: -0.041259245 hartree
energy: -1914.435283653229 hartree
dipole: -15.57655 16.19614 0.61958 0.25760 1.04479 1.30239 0.63302 0.84070 1.47372
magnitude: 2.06202 au
magnitude: 5.24125 debye
