program: Orca
programVersion: 5.0.2
elementType: O O O O O O O O O O O O O N N N N N C C C C C C C C C C C C C C C C C H H H H H H H H H H H H H H H H H H H H H H H H
charge: -1
multiplicity: 1
keywords: wb97x-d3
keywords: def2-TZVPP
keywords: def2/J RIJCOSX
keywords: DEFGRID2
keywords: scfconv7
keywords: smallprint printgap noloewdin
keywords: NOSOSCF
formula: C17H24N5O13
InChI: InChI=1/C17H24N5O13/c18-6(8(25)5(24)3-34-16(19)32)13(29)20-7(15(30)31)11-9(26)10(27)14(35-11)22-1-4(2-23)12(28)21-17(22)33/h1,5-11,14,20-21,23-27H,2-3,18-19H2
59 atoms
O  1.352374 2.173179 0.7982
O  0.520485 2.914988 -2.595009
O  2.726462 3.83213 -1.467427
O  -1.930084 2.976382 -1.646113
O  -3.012417 1.230635 -0.810918
O  5.162952 1.910364 1.336131
O  -0.881198 0.50593 2.71831
O  -1.50917 -1.987882 -0.612381
O  -3.595571 -0.510073 1.269834
O  5.142997 -2.601875 1.190484
O  3.165515 -3.460403 -1.054455
O  -4.297183 -1.615582 -1.174711
O  -6.474844 -1.770272 -1.726666
N  3.285593 0.89361 0.512559
N  -0.755478 0.416488 0.46118
N  5.09139 -0.34452 1.256128
N  -1.18712 -2.230246 3.012205
N  -5.126761 -0.1622 -2.614877
C  0.363659 2.528018 -0.161757
C  0.988157 2.16157 -1.514727
C  2.468894 2.467377 -1.266349
C  2.632734 2.174606 0.231573
C  -0.94044 1.820316 0.209786
C  -2.05129 2.024386 -0.846789
C  2.669307 -0.282465 0.18813
C  4.553243 0.89891 1.055011
C  -0.876566 -0.14122 1.681281
C  -0.944779 -1.680672 1.698713
C  -1.956289 -2.282614 0.702471
C  3.214466 -1.496874 0.372814
C  -3.404851 -1.875882 1.021024
C  4.533522 -1.571388 0.957622
C  2.514261 -2.76601 -0.012024
C  -4.423487 -2.399525 0.011365
C  -5.402545 -1.211904 -1.824091
H  0.191618 3.610625 -0.128004
H  0.862835 1.085183 -1.704265
H  3.13546 1.843124 -1.873968
H  3.257328 2.939143 0.692828
H  -1.308389 2.280619 1.133381
H  -0.870848 -0.219884 -0.318774
H  -0.432671 3.083125 -2.410908
H  2.111057 4.133976 -2.150389
H  1.67772 -0.198544 -0.230684
H  0.041092 -2.036162 1.37694
H  -1.913202 -3.369038 0.853655
H  6.019733 -0.350598 1.664606
H  -3.640196 -2.397338 1.955257
H  -0.387868 -2.054925 3.606942
H  -1.962851 -1.75109 3.454148
H  1.511845 -2.524072 -0.370804
H  2.389796 -3.403387 0.870545
H  -4.252844 -3.454519 -0.219263
H  -5.426627 -2.30588 0.42953
H  -2.251361 -1.947383 -1.225909
H  -3.366456 0.035689 0.486792
H  3.952335 -3.878541 -0.690373
H  -4.335683 0.427477 -2.389226
H  -5.902161 0.278828 -3.081702
elementType: O N C H
totalener: -1914.48683818 hartree
nucrepener: 4299.03783759 hartree
electener: -6213.52467578 hartree
twoeener: 4994.09053790 hartree
cpcmener: -0.13045338 hartree
kineticenergy: 1906.83433272 hartree
xcener: -172.829120792114 hartree
chargesum: -1.0000000
charge: -0.360856 -0.489453 -0.436115 -0.573265 -0.584322 -0.482869 -0.517832 -0.424686 -0.473430 -0.491111 -0.430267 -0.321067 -0.508080 -0.036303 -0.229794 -0.130733 -0.406470 -0.329277 0.110770 0.048224 0.148424 0.159465 0.026252 0.367753 0.069408 0.387475 0.165610 0.210115 0.096618 -0.211046 0.168711 0.322014 0.083644 -0.015509 0.463118 0.115841 0.102292 0.104940 0.099246 0.101905 0.201656 0.260118 0.234563 0.124189 0.089908 0.089749 0.183830 0.100796 0.141627 0.141776 0.074503 0.106124 0.112714 0.106545 0.233738 0.245098 0.237352 0.221946 0.194425
qa: -0.3609 -0.4895 -0.4361 -0.5733 -0.5843 -0.4829 -0.5178 -0.4247 -0.4734 -0.4911 -0.4303 -0.3211 -0.5081 -0.0363 -0.2298 -0.1307 -0.4065 -0.3293 0.1108 0.0482 0.1484 0.1595 0.0263 0.3678 0.0694 0.3875 0.1656 0.2101 0.0966 -0.2110 0.1687 0.3220 0.0836 -0.0155 0.4631 0.1158 0.1023 0.1049 0.0992 0.1019 0.2017 0.2601 0.2346 0.1242 0.0899 0.0897 0.1838 0.1008 0.1416 0.1418 0.0745 0.1061 0.1127 0.1065 0.2337 0.2451 0.2374 0.2219 0.1944
va: 2.0293 1.9490 2.0236 1.8807 1.8990 2.0388 1.9994 2.0052 1.9829 2.0346 1.9578 2.0296 2.0025 3.1743 3.0987 3.2166 3.1065 3.1756 3.9205 3.9702 3.9501 3.7995 3.6517 4.3868 4.0192 4.3472 4.4231 3.7848 3.8878 3.5506 3.9134 4.3002 3.9325 3.8354 4.3870 1.0292 1.0117 1.0163 1.0570 1.0486 1.0439 1.0603 1.0348 1.0303 1.0261 1.0297 1.0191 1.0185 1.0265 1.0300 1.0208 0.9842 1.0010 1.0203 1.0351 1.0808 1.0059 1.0302 1.0034
dispersion: -0.041182670 hartree
energy: -1914.528020852486 hartree
dipole: -10.11831 11.98700 1.86869 -9.84484 7.34247 -2.50237 -0.57322 0.40451 -0.16871
magnitude: 3.12767 au
magnitude: 7.94991 debye
