program: Orca
programVersion: 5.0.2
elementType: O O O O O O O O O O O O O N N N N N C C C C C C C C C C C C C C C C C H H H H H H H H H H H H H H H H H H H H H H H H
charge: -1
multiplicity: 1
keywords: wb97x-d3
keywords: def2-TZVPP
keywords: def2/J RIJCOSX
keywords: DEFGRID2
keywords: scfconv7
keywords: smallprint printgap noloewdin
keywords: NOSOSCF
formula: C17H24N5O13
InChI: InChI=1/C17H24N5O13/c18-6(8(25)5(24)3-34-16(19)32)13(29)20-7(15(30)31)11-9(26)10(27)14(35-11)22-1-4(2-23)12(28)21-17(22)33/h1,5-11,14,20-21,23-27H,2-3,18-19H2
59 atoms
O  1.117622 2.449678 0.721998
O  1.116228 4.819199 -1.190535
O  3.61324 4.035503 -1.100779
O  0.088634 -0.866283 -1.006152
O  1.367845 0.496044 -2.214319
O  5.153075 2.012095 0.284485
O  -3.164701 2.198803 -0.770152
O  -4.209634 -0.845264 -0.929927
O  -5.608549 -1.550545 1.566967
O  4.765579 -2.456145 0.864021
O  1.578729 -2.940861 0.128271
O  -3.012644 -3.856175 0.527342
O  -3.067617 -3.318326 -1.669913
N  3.087401 1.188333 0.75815
N  -1.371494 1.070365 0.020932
N  4.921576 -0.211529 0.640048
N  -4.871777 1.018062 1.127609
N  -1.275414 -4.347775 -0.750976
C  0.354999 2.713945 -0.459987
C  1.304675 3.437271 -1.4080
C  2.70126 2.979222 -0.962358
C  2.486965 2.52571 0.501316
C  -0.401611 1.479302 -0.967392
C  0.438407 0.261787 -1.426014
C  2.329622 0.10682 1.085258
C  4.433418 1.059696 0.544075
C  -2.678392 1.35452 -0.025706
C  -3.534144 0.496677 0.909328
C  -3.583289 -0.923851 0.330925
C  2.807942 -1.149834 1.158671
C  -4.271312 -1.901596 1.290182
C  4.203699 -1.371033 0.879229
C  1.884002 -2.311474 1.356141
C  -4.320904 -3.331436 0.756044
C  -2.489418 -3.790791 -0.701297
H  -0.426911 3.420874 -0.170426
H  1.123405 3.177141 -2.454693
H  2.994432 2.117977 -1.565926
H  2.934438 3.227652 1.20966
H  -0.945807 1.821544 -1.854309
H  -1.077386 0.331484 0.641873
H  1.804562 5.295591 -1.66714
H  4.48192 3.689538 -0.863037
H  1.293143 0.307332 1.306931
H  -3.031949 0.433308 1.878605
H  -2.54268 -1.259496 0.235756
H  5.915929 -0.311781 0.465759
H  -3.661857 -1.905396 2.207417
H  -4.82821 1.83312 1.726453
H  -5.271948 1.327935 0.249509
H  0.980206 -1.962618 1.868403
H  2.341095 -3.063171 2.001145
H  -4.765354 -3.978898 1.511766
H  -4.939777 -3.398719 -0.140104
H  -3.993109 -1.662303 -1.405537
H  -5.626094 -0.565705 1.5738
H  1.103243 -2.280832 -0.411805
H  -0.776804 -4.57388 0.094101
H  -0.72299 -4.203734 -1.580492
elementType: O N C H
totalener: -1914.50678468 hartree
nucrepener: 4282.10140111 hartree
electener: -6196.60818578 hartree
twoeener: 4979.81167841 hartree
cpcmener: -0.17206483 hartree
kineticenergy: 1906.81304411 hartree
xcener: -172.830132171372 hartree
chargesum: -1.0000000
charge: -0.377315 -0.432867 -0.439385 -0.629374 -0.599547 -0.533916 -0.563545 -0.471757 -0.501155 -0.520026 -0.492792 -0.317264 -0.549270 -0.046638 -0.184622 -0.118435 -0.363029 -0.280629 0.172479 0.144889 0.040824 0.158630 0.010392 0.385252 0.016232 0.412992 0.255103 0.170699 0.068939 -0.162914 0.129894 0.317160 0.042167 0.002782 0.507899 0.089097 0.102529 0.116552 0.127403 0.095728 0.174139 0.236150 0.255318 0.173070 0.131824 0.095720 0.189201 0.074954 0.153398 0.148471 0.107686 0.104586 0.118417 0.102496 0.249514 0.240262 0.252975 0.202016 0.206642
qa: -0.3773 -0.4329 -0.4394 -0.6294 -0.5995 -0.5339 -0.5635 -0.4718 -0.5012 -0.5200 -0.4928 -0.3173 -0.5493 -0.0466 -0.1846 -0.1184 -0.3630 -0.2806 0.1725 0.1449 0.0408 0.1586 0.0104 0.3853 0.0162 0.4130 0.2551 0.1707 0.0689 -0.1629 0.1299 0.3172 0.0422 0.0028 0.5079 0.0891 0.1025 0.1166 0.1274 0.0957 0.1741 0.2361 0.2553 0.1731 0.1318 0.0957 0.1892 0.0750 0.1534 0.1485 0.1077 0.1046 0.1184 0.1025 0.2495 0.2403 0.2530 0.2020 0.2066
va: 2.0174 1.9961 1.9890 1.8304 1.8579 1.9677 1.9353 1.9654 1.9174 2.0030 1.8976 2.0782 1.9409 3.2441 3.1906 3.2235 3.1594 3.2557 3.8131 3.9773 3.9240 3.8512 3.6520 4.3763 3.9783 4.3099 4.3022 3.7302 3.8768 3.5351 3.9489 4.3185 3.9635 3.7803 4.3347 1.0440 1.0289 1.0430 1.0136 1.0483 1.0243 1.0111 1.0093 0.9982 1.0143 1.0194 1.0154 1.0105 1.0186 1.0426 0.9881 0.9974 1.0086 1.0361 1.0408 1.0826 1.0533 1.0113 1.0010
dispersion: -0.040823953 hartree
energy: -1914.547608629382 hartree
dipole: -16.76931 17.23795 0.46864 -2.15647 3.11745 0.96099 5.04456 -0.89680 4.14777
magnitude: 4.28335 au
magnitude: 10.88741 debye
