program: Orca
programVersion: 5.0.2
elementType: O O O O O O O O O O O O O N N N N N C C C C C C C C C C C C C C C C C H H H H H H H H H H H H H H H H H H H H H H H H
charge: -1
multiplicity: 1
keywords: wb97x-d3
keywords: def2-TZVPP
keywords: def2/J RIJCOSX
keywords: DEFGRID2
keywords: scfconv7
keywords: smallprint printgap noloewdin
keywords: NOSOSCF
formula: C17H24N5O13
InChI: InChI=1/C17H24N5O13/c18-6(8(25)5(24)3-34-16(19)32)13(29)20-7(15(30)31)11-9(26)10(27)14(35-11)22-1-4(2-23)12(28)21-17(22)33/h1,5-11,14,20-21,23-27H,2-3,18-19H2
59 atoms
O  0.220258 0.976708 -0.270618
O  0.389622 4.250582 -0.580304
O  2.887815 3.365075 -0.184023
O  -0.173742 -0.766369 -3.142852
O  0.991493 1.077921 -3.572884
O  1.828002 0.922734 3.022497
O  -3.521623 2.023239 -1.105167
O  -5.062046 1.039651 1.056749
O  -3.329485 0.332329 2.929864
O  4.129534 -2.836462 2.061689
O  3.024002 -3.696873 -0.873282
O  -1.424492 -1.497428 0.54147
O  0.141356 -2.712797 1.613493
N  2.182232 0.442245 0.811995
N  -2.104784 0.46283 -1.920362
N  3.033339 -0.908547 2.487079
N  -3.87265 -1.63244 -1.14622
N  0.147236 -2.506367 -0.648783
C  -0.384439 1.987163 -1.077407
C  0.685926 3.078128 -1.308645
C  1.948244 2.46064 -0.690625
C  1.340415 1.530672 0.363071
C  -1.004561 1.320944 -2.306774
C  0.030955 0.465852 -3.075636
C  2.670622 -0.450358 -0.103545
C  2.304816 0.203229 2.167121
C  -3.212928 0.838607 -1.296379
C  -4.130416 -0.264915 -0.765676
C  -4.270271 -0.100467 0.766406
C  3.357515 -1.557021 0.22467
C  -2.971829 0.008379 1.600478
C  3.553704 -1.852014 1.624887
C  3.831922 -2.533021 -0.806047
C  -2.135117 -1.256119 1.747788
C  -0.326529 -2.266232 0.57947
H  -1.188579 2.456893 -0.503904
H  0.824454 3.306781 -2.366391
H  2.457033 1.875966 -1.458915
H  1.060828 2.107456 1.249101
H  -1.360635 2.116202 -2.969201
H  -1.931115 -0.52282 -2.061149
H  -0.318742 4.718529 -1.034381
H  2.427899 4.008047 0.3687
H  2.477355 -0.217964 -1.14211
H  -5.120849 -0.018461 -1.15796
H  -4.831654 -0.968601 1.125452
H  3.139923 -1.085078 3.480362
H  -2.331677 0.798574 1.17991
H  -3.940515 -1.735289 -2.150167
H  -2.953495 -1.945964 -0.865936
H  4.877359 -2.798551 -0.622525
H  3.788824 -2.06428 -1.789417
H  -1.437651 -1.099801 2.572435
H  -2.76361 -2.118343 1.989371
H  -4.714789 1.768918 0.519505
H  -4.028048 0.996524 2.87324
H  3.168208 -4.21438 -0.073337
H  -0.132799 -1.928717 -1.433636
H  1.055912 -2.947087 -0.714548
elementType: O N C H
totalener: -1914.50526119 hartree
nucrepener: 4484.42620741 hartree
electener: -6398.93146861 hartree
twoeener: 5181.30808481 hartree
cpcmener: -0.16078054 hartree
kineticenergy: 1906.77962147 hartree
xcener: -172.817409209219 hartree
chargesum: -1.0000000
charge: -0.368923 -0.420446 -0.443128 -0.615450 -0.610557 -0.502576 -0.585296 -0.466274 -0.449790 -0.511672 -0.422691 -0.306787 -0.551386 -0.037384 -0.176608 -0.115201 -0.403230 -0.357925 0.086410 0.093615 0.176612 0.133251 0.055610 0.335915 0.050568 0.384655 0.255504 0.087523 0.164485 -0.209520 0.129833 0.319339 0.072077 -0.028661 0.495846 0.090443 0.100488 0.110143 0.128280 0.113126 0.171404 0.236034 0.240171 0.144069 0.109121 0.096570 0.190221 0.085650 0.146329 0.162843 0.118472 0.106842 0.104861 0.127221 0.244424 0.241852 0.242648 0.221324 0.209722
qa: -0.3689 -0.4204 -0.4431 -0.6154 -0.6106 -0.5026 -0.5853 -0.4663 -0.4498 -0.5117 -0.4227 -0.3068 -0.5514 -0.0374 -0.1766 -0.1152 -0.4032 -0.3579 0.0864 0.0936 0.1766 0.1333 0.0556 0.3359 0.0506 0.3847 0.2555 0.0875 0.1645 -0.2095 0.1298 0.3193 0.0721 -0.0287 0.4958 0.0904 0.1005 0.1101 0.1283 0.1131 0.1714 0.2360 0.2402 0.1441 0.1091 0.0966 0.1902 0.0857 0.1463 0.1628 0.1185 0.1068 0.1049 0.1272 0.2444 0.2419 0.2426 0.2213 0.2097
va: 1.9624 2.0203 2.0047 1.8182 1.8380 2.0060 1.9095 1.9737 1.9751 2.0063 1.9652 2.0542 1.9496 3.2136 3.2059 3.2182 3.0603 3.1679 3.6759 4.0861 3.7891 3.8321 3.7082 4.4515 3.9854 4.3446 4.2200 3.9211 3.9037 3.5335 3.9948 4.2890 3.8814 3.8142 4.2956 1.0529 1.0389 1.0447 1.0442 1.0224 1.0675 1.0011 1.0097 1.0061 1.0352 1.0301 1.0149 1.0332 1.0182 1.0475 0.9931 0.9982 1.0243 1.0043 1.0327 1.0202 1.0009 1.0412 1.0566
dispersion: -0.045814917 hartree
energy: -1914.551076111170 hartree
dipole: -10.89763 10.20267 -0.69496 0.40479 1.10864 1.51342 -3.97411 4.42369 0.44958
magnitude: 1.72498 au
magnitude: 4.38454 debye
