program: Orca
programVersion: 5.0.4
elementType: C C C C C N C C C C C N C C C O C O N N C H H H C H H H C H H H C H H H Ce N O O O N O O O N O O O H H C H H H C H H H C H H H C H H H
elementType: Ce
keywords: def2-SVPD def2/JK def2/J def2-SVPD/C PBE rijcosx rhf hcore XYZFile VeryTightSCF freq cpcm(water) D3 defgrid3
charge: 0
multiplicity: 1
frequency: 0.00 0.00 0.00 0.00 0.00 0.00 16.48 21.80 27.31 31.83 33.99 37.18 39.52 43.69 55.38 66.01 70.83 74.85 77.66 79.29 86.72 87.89 98.71 99.74 100.76 103.72 111.94 112.71 113.66 119.41 123.84 140.53 142.03 150.21 159.06 162.64 164.89 174.17 180.08 185.90 189.95 194.60 200.15 204.40 217.64 221.61 225.03 238.44 244.21 257.22 266.22 266.70 280.11 293.40 300.34 310.17 336.14 343.37 365.69 396.14 399.07 415.29 429.02 441.05 457.59 461.23 473.47 479.34 520.51 532.30 547.88 557.95 594.47 602.66 615.05 621.00 653.79 678.49 683.66 703.29 704.35 704.64 719.70 724.13 728.08 730.16 734.49 754.67 774.27 795.12 799.29 799.42 800.63 802.17 851.89 872.83 875.95 894.85 935.53 965.78 971.43 978.16 980.98 992.24 999.53 1001.79 1004.25 1007.59 1029.59 1044.78 1045.96 1046.24 1052.17 1054.38 1055.80 1072.37 1073.69 1097.80 1118.79 1121.25 1131.98 1138.94 1181.95 1193.92 1227.86 1244.43 1250.25 1272.96 1279.94 1281.89 1286.67 1315.99 1317.57 1321.85 1328.89 1330.59 1336.28 1337.44 1359.33 1372.22 1373.15 1375.44 1377.89 1383.75 1386.13 1389.14 1389.35 1393.49 1395.35 1396.20 1399.15 1401.22 1402.49 1412.29 1413.08 1414.69 1416.56 1417.42 1419.72 1423.09 1435.60 1449.61 1453.79 1461.71 1466.96 1469.38 1488.31 1494.97 1506.85 1545.96 1556.86 1586.04 1591.09 1606.19 1614.64 2975.68 2975.83 2978.86 2979.53 2979.61 2980.24 2981.00 2984.41 3046.99 3055.06 3056.72 3057.78 3059.06 3062.03 3062.19 3062.89 3094.77 3095.91 3110.80 3112.72 3114.25 3119.21 3120.19 3122.76 3136.98 3144.66
frequency: 16.48 21.80 27.31 31.83 33.99 37.18 39.52 43.69 55.38 66.01 70.83 74.85 77.66 79.29 86.72 87.89 98.71 99.74 100.76 103.72 111.94 112.71 113.66 119.41 123.84 140.53 142.03 150.21 159.06 162.64 164.89 174.17 180.08 185.90 189.95 194.60 200.15 204.40 217.64 221.61 225.03 238.44 244.21 257.22 266.22 266.70 280.11 293.40 300.34 310.17 336.14 343.37 365.69 396.14 399.07 415.29 429.02 441.05 457.59 461.23 473.47 479.34 520.51 532.30 547.88 557.95 594.47 602.66 615.05 621.00 653.79 678.49 683.66 703.29 704.35 704.64 719.70 724.13 728.08 730.16 734.49 754.67 774.27 795.12 799.29 799.42 800.63 802.17 851.89 872.83 875.95 894.85 935.53 965.78 971.43 978.16 980.98 992.24 999.53 1001.79 1004.25 1007.59 1029.59 1044.78 1045.96 1046.24 1052.17 1054.38 1055.80 1072.37 1073.69 1097.80 1118.79 1121.25 1131.98 1138.94 1181.95 1193.92 1227.86 1244.43 1250.25 1272.96 1279.94 1281.89 1286.67 1315.99 1317.57 1321.85 1328.89 1330.59 1336.28 1337.44 1359.33 1372.22 1373.15 1375.44 1377.89 1383.75 1386.13 1389.14 1389.35 1393.49 1395.35 1396.20 1399.15 1401.22 1402.49 1412.29 1413.08 1414.69 1416.56 1417.42 1419.72 1423.09 1435.60 1449.61 1453.79 1461.71 1466.96 1469.38 1488.31 1494.97 1506.85 1545.96 1556.86 1586.04 1591.09 1606.19 1614.64 2975.68 2975.83 2978.86 2979.53 2979.61 2980.24 2981.00 2984.41 3046.99 3055.06 3056.72 3057.78 3059.06 3062.03 3062.19 3062.89 3094.77 3095.91 3110.80 3112.72 3114.25 3119.21 3120.19 3122.76 3136.98 3144.66
formula: C22H26CeN7O11
InChI: InChI=1/C22H26N4O2.Ce.3NO3/c1-11-9-15(21(27)25(5)6)23-19-17(11)13(3)14(4)18-12(2)10-16(24-20(18)19)22(28)26(7)8;;3*2-1(3)4/h9-10H,1-8H3;;;;/q-4;+10;3*-2/rC22H26CeN7O11/c1-11-9-15-21(24(5)6)34-23(36-28(31)37-23,38-29(32)39-23,40-30(33)41-23)26(15)19-17(11)13(3)14(4)18-12(2)10-16(27(23)20(18)19)22(35-23)25(7)8/h9-10H,1-8H3
67 atoms
C  -0.110149 -0.431119 -4.057952
C  -0.229785 0.9504 -4.248858
C  -0.349678 -0.949061 -2.738495
C  -0.527122 1.803093 -3.172485
C  -0.47803 0.016188 -1.689274
N  -0.590938 1.343885 -1.916658
C  -0.466113 -2.357988 -2.391263
C  -0.361065 -2.766431 -1.05998
C  -0.124447 -1.788683 -0.010239
C  -0.367869 -0.409831 -0.304005
C  0.347453 -2.081051 1.314676
N  -0.408206 0.551653 0.643215
C  -0.171119 0.225616 1.919652
C  0.28702 -1.058541 2.267665
C  -0.582737 3.305597 -3.271608
O  -0.072443 3.965047 -2.317851
C  -0.275658 1.390516 2.868416
O  -0.069603 2.548417 2.396393
N  -1.137138 3.906909 -4.334547
N  -0.573139 1.20932 4.16586
C  -1.971494 3.242212 -5.3336
H  -1.435678 3.15356 -6.298028
H  -2.287188 2.247424 -4.985923
H  -2.87493 3.85949 -5.487991
C  -1.059673 5.36091 -4.452309
H  -0.222842 5.740075 -3.846918
H  -0.907401 5.619235 -5.515215
H  -2.004891 5.822037 -4.104595
C  -1.103126 -0.021075 4.752114
H  -1.508377 -0.686245 3.975204
H  -0.325027 -0.549553 5.335903
H  -1.925115 0.256685 5.435824
C  -0.521118 2.354948 5.071966
H  -1.538921 2.760765 5.234513
H  -0.115155 2.014721 6.04126
H  0.122391 3.139534 4.646972
Ce -0.593632 3.149514 0.016572
N  2.465114 3.391396 0.122313
O  3.693309 3.48879 0.182558
O  1.69949 4.366773 0.440505
O  1.89616 2.312744 -0.260077
N  -3.562048 2.66275 -0.65288
O  -4.752794 2.485365 -0.926158
O  -2.853238 3.520948 -1.284836
O  -2.978559 1.999199 0.267958
N  -1.89388 5.794868 0.968013
O  -2.441453 6.841653 1.329299
O  -2.179427 4.671299 1.508132
O  -1.018185 5.783002 0.038674
H  0.657885 -1.254851 3.280191
H  -0.031569 1.37226 -5.241594
C  0.991491 -3.379731 1.723145
H  1.731383 -3.18271 2.519325
H  0.252569 -4.092653 2.139074
H  1.500998 -3.874548 0.879793
C  -0.599508 -4.212192 -0.700101
H  -0.809293 -4.34441 0.369695
H  -1.474235 -4.602835 -1.250364
H  0.258836 -4.859136 -0.970576
C  -0.794557 -3.370487 -3.459328
H  0.109458 -3.896115 -3.826878
H  -1.470393 -4.148236 -3.065917
H  -1.296197 -2.908572 -4.322072
C  0.358072 -1.254851 -5.228177
H  1.00822 -2.087744 -4.913028
H  -0.490197 -1.686019 -5.794631
H  0.920289 -0.61059 -5.926917
elementType: C N O H Ce
totalener: -2093.41414182 hartree
nucrepener: 5424.29218261 hartree
electener: -7517.70632444 hartree
twoeener: 6158.71828251 hartree
cpcmener: -0.10098074 hartree
kineticenergy: 2049.68117948 hartree
exchangeener: -262.889142368679 hartree
correlationener: -10.421429904407 hartree
xcener: -273.310572273086 hartree
chargesum: 0.0000000
charge: -1.188273 -0.130802 0.161763 -0.231482 0.141797 -0.036514 -1.896172 -1.966610 0.275663 0.315577 -1.303393 -0.200149 -0.222779 -0.186353 0.717354 -1.020046 0.766792 -1.077680 -1.436453 -1.362646 0.938307 0.096604 -0.013858 -0.148793 1.056913 -0.130036 -0.063713 0.049600 0.885611 0.035561 0.124573 -0.208790 1.027539 0.036387 -0.027514 -0.154405 3.847794 0.496024 -0.430030 -0.597601 -0.613269 0.486253 -0.445720 -0.578417 -0.586316 0.508913 -0.447502 -0.622162 -0.568578 -0.115390 -0.164530 1.016039 -0.026293 0.283503 0.241585 1.586147 -0.221333 0.043878 0.243570 1.531892 0.221145 -0.186250 0.026098 0.990296 0.224207 0.253553 -0.021086
charge: -0.092749 0.116971 0.004823 -0.035837 -0.009220 -0.059425 -0.080034 -0.080725 0.003691 -0.013064 -0.096123 -0.059896 -0.030245 0.115560 -0.055419 -0.331867 -0.027987 -0.336819 -0.203181 -0.204963 0.240378 0.024138 0.005241 0.020872 0.247529 0.000704 0.021077 0.028115 0.238786 0.005799 0.024272 0.019900 0.245112 0.028311 0.021732 -0.000385 1.935820 -0.386199 -0.051481 -0.192745 -0.190963 -0.380830 -0.054701 -0.187836 -0.191099 -0.389475 -0.059924 -0.185959 -0.184600 0.032787 0.037248 0.160125 0.010802 0.022440 0.009224 0.165494 -0.018379 -0.002833 0.031502 0.167916 0.029059 -0.011844 -0.009061 0.161379 0.008584 0.020991 0.009485
qa: -1.1883 -0.1308 0.1618 -0.2315 0.1418 -0.0365 -1.8962 -1.9666 0.2757 0.3156 -1.3034 -0.2001 -0.2228 -0.1864 0.7174 -1.0200 0.7668 -1.0777 -1.4365 -1.3626 0.9383 0.0966 -0.0139 -0.1488 1.0569 -0.1300 -0.0637 0.0496 0.8856 0.0356 0.1246 -0.2088 1.0275 0.0364 -0.0275 -0.1544 3.8478 0.4960 -0.4300 -0.5976 -0.6133 0.4863 -0.4457 -0.5784 -0.5863 0.5089 -0.4475 -0.6222 -0.5686 -0.1154 -0.1645 1.0160 -0.0263 0.2835 0.2416 1.5861 -0.2213 0.0439 0.2436 1.5319 0.2211 -0.1863 0.0261 0.9903 0.2242 0.2536 -0.0211
va: 6.2686 3.9098 4.8045 4.5531 4.6836 4.7483 5.9150 5.9672 4.6328 4.3418 6.3533 4.7493 4.5343 4.2527 3.5457 1.5246 3.2422 1.6512 5.6051 5.4853 3.7371 0.8406 1.0801 0.9059 3.5736 1.1292 0.9059 0.8549 3.7922 1.0179 0.8256 0.9300 3.5804 0.8631 0.8951 1.1544 -1.8990 4.1261 1.7647 1.4630 1.4159 4.1598 1.7615 1.2271 1.4961 4.1375 1.7508 1.3945 1.4360 1.3822 1.3737 3.8788 1.0805 0.8227 0.9982 2.4898 1.3842 0.8592 0.8090 2.6186 0.8505 1.1712 1.2104 3.8438 1.0570 0.8785 1.0903
dispersion: -0.100151209 hartree
energy: -2093.514293032889 hartree
dipole: 0.95252 -0.04927 0.90325 -195.83632 184.83079 -11.00553 -60.75059 58.03233 -2.71826
magnitude: 11.37219 au
magnitude: 28.90580 debye
temp: 298.15 k
press: 1.00 atm
zeropoint: 0.48278576 hartree
thermalvibcorrection: 0.04148282 hartree
thermalrotcorrection: 0.00141627 hartree
thermaltrasncorrection: 0.00141627 hartree
thermaltotal: -2092.98719191 hartree
thermalcorr: 0.04431536 hartree
nonthermalcorr: 0.48278576 hartree
totalcorr: 0.52710113 hartree
thermalcorrenthalpy: 0.00094421 hartree
totalenthalpy: -2092.98624770 hartree
vibrat: 0.07694779 hartree
rotat: 0.01798030 hartree
transl: 0.02163647 hartree
total: 0.11656456 hartree
totalentropycorr: -0.11656456 hartree
gibbsenthalpy: -2093.10281226 hartree
gibbsminuselec: 0.41148078 hartree
