program: Orca
programVersion: 5.0.4
elementType: C C C C C N C C C C C N C C C O C O N N C H H H C H H H C H H H C H H H Ho N O O O N O O O N O O O H H C H H H C H H H C H H H C H H H
elementType: Ho
keywords: def2-SVPD def2/JK def2/J def2-SVPD/C PBE rijcosx rhf hcore XYZFile VeryTightSCF freq cpcm(water) D3 defgrid3
charge: 0
multiplicity: 1
frequency: 0.00 0.00 0.00 0.00 0.00 0.00 19.61 23.29 30.80 33.88 36.47 42.44 50.32 55.65 56.50 65.40 75.56 82.42 85.91 89.89 98.95 103.90 107.23 108.11 111.76 113.75 119.98 122.12 133.05 141.83 143.84 152.78 153.88 156.36 162.62 167.91 173.10 177.84 184.66 186.39 191.93 196.74 204.56 211.90 221.60 225.59 230.62 243.61 247.76 264.12 267.37 269.37 279.78 293.32 304.90 311.65 335.30 341.42 368.06 398.31 398.98 420.29 431.72 442.43 464.47 465.19 476.66 482.26 522.17 533.22 554.62 559.95 595.63 605.99 612.92 622.76 656.20 680.07 684.87 700.99 702.73 703.29 718.81 723.80 735.46 737.08 742.34 754.05 776.22 795.73 797.58 798.17 799.57 806.35 852.47 869.72 873.55 895.55 935.37 966.34 972.31 979.78 982.05 992.52 999.97 1001.89 1004.23 1008.04 1031.64 1045.90 1046.34 1046.87 1057.47 1058.93 1060.60 1072.87 1073.73 1099.84 1118.51 1119.82 1135.93 1140.53 1183.82 1196.72 1229.33 1245.50 1251.61 1280.04 1286.37 1295.47 1301.84 1315.19 1319.02 1323.16 1329.09 1330.83 1336.44 1338.34 1361.95 1372.89 1374.48 1376.81 1380.77 1384.70 1386.56 1389.63 1391.15 1394.17 1395.53 1397.35 1399.70 1402.30 1404.94 1412.53 1414.64 1415.54 1416.38 1418.64 1419.41 1424.79 1436.03 1450.87 1459.69 1466.37 1466.79 1473.56 1490.60 1494.47 1507.41 1549.41 1559.34 1587.10 1590.20 1611.59 1617.75 2975.50 2975.66 2978.83 2979.19 2979.84 2980.39 2980.93 2983.95 3047.95 3056.25 3058.19 3058.47 3058.80 3062.04 3063.29 3064.80 3093.56 3094.81 3110.53 3111.38 3112.53 3118.41 3119.53 3122.08 3144.16 3150.51
frequency: 19.61 23.29 30.80 33.88 36.47 42.44 50.32 55.65 56.50 65.40 75.56 82.42 85.91 89.89 98.95 103.90 107.23 108.11 111.76 113.75 119.98 122.12 133.05 141.83 143.84 152.78 153.88 156.36 162.62 167.91 173.10 177.84 184.66 186.39 191.93 196.74 204.56 211.90 221.60 225.59 230.62 243.61 247.76 264.12 267.37 269.37 279.78 293.32 304.90 311.65 335.30 341.42 368.06 398.31 398.98 420.29 431.72 442.43 464.47 465.19 476.66 482.26 522.17 533.22 554.62 559.95 595.63 605.99 612.92 622.76 656.20 680.07 684.87 700.99 702.73 703.29 718.81 723.80 735.46 737.08 742.34 754.05 776.22 795.73 797.58 798.17 799.57 806.35 852.47 869.72 873.55 895.55 935.37 966.34 972.31 979.78 982.05 992.52 999.97 1001.89 1004.23 1008.04 1031.64 1045.90 1046.34 1046.87 1057.47 1058.93 1060.60 1072.87 1073.73 1099.84 1118.51 1119.82 1135.93 1140.53 1183.82 1196.72 1229.33 1245.50 1251.61 1280.04 1286.37 1295.47 1301.84 1315.19 1319.02 1323.16 1329.09 1330.83 1336.44 1338.34 1361.95 1372.89 1374.48 1376.81 1380.77 1384.70 1386.56 1389.63 1391.15 1394.17 1395.53 1397.35 1399.70 1402.30 1404.94 1412.53 1414.64 1415.54 1416.38 1418.64 1419.41 1424.79 1436.03 1450.87 1459.69 1466.37 1466.79 1473.56 1490.60 1494.47 1507.41 1549.41 1559.34 1587.10 1590.20 1611.59 1617.75 2975.50 2975.66 2978.83 2979.19 2979.84 2980.39 2980.93 2983.95 3047.95 3056.25 3058.19 3058.47 3058.80 3062.04 3063.29 3064.80 3093.56 3094.81 3110.53 3111.38 3112.53 3118.41 3119.53 3122.08 3144.16 3150.51
formula: C22H26HoN7O11
InChI: InChI=1/C22H26N4O2.Ho.3NO3/c1-11-9-15(21(27)25(5)6)23-19-17(11)13(3)14(4)18-12(2)10-16(24-20(18)19)22(28)26(7)8;;3*2-1(3)4/h9-10H,1-8H3;;;;/q-4;+10;3*-2/rC22H26HoN7O11/c1-11-9-15-21(24(5)6)34-23(36-28(31)37-23,38-29(32)39-23,40-30(33)41-23)26(15)19-17(11)13(3)14(4)18-12(2)10-16(27(23)20(18)19)22(35-23)25(7)8/h9-10H,1-8H3
67 atoms
C  -0.142529 -0.417342 -4.047632
C  -0.235269 0.969584 -4.224062
C  -0.400733 -0.947294 -2.736554
C  -0.544088 1.817846 -3.146165
C  -0.53534 0.01091 -1.685154
N  -0.639003 1.339675 -1.899462
C  -0.522562 -2.356824 -2.389698
C  -0.428632 -2.767625 -1.056997
C  -0.191418 -1.792811 -0.003041
C  -0.4247 -0.415976 -0.303288
C  0.277755 -2.077337 1.324973
N  -0.440349 0.555266 0.630815
C  -0.182431 0.250742 1.907401
C  0.251896 -1.039607 2.265364
C  -0.581086 3.322879 -3.195642
O  -0.183777 3.93616 -2.160135
C  -0.236955 1.459025 2.804303
O  -0.097413 2.588632 2.246829
N  -0.997962 3.981119 -4.287399
N  -0.416947 1.35566 4.131045
C  -1.721607 3.381459 -5.406824
H  -1.069546 3.288684 -6.296673
H  -2.126881 2.396313 -5.131782
H  -2.567467 4.045602 -5.659277
C  -0.88363 5.437488 -4.323544
H  -0.090486 5.767525 -3.635941
H  -0.641556 5.743286 -5.356363
H  -1.844098 5.903493 -4.027941
C  -0.871581 0.157445 4.834577
H  -1.361833 -0.544774 4.143706
H  -0.031984 -0.34287 5.35469
H  -1.613059 0.47161 5.590396
C  -0.304071 2.556351 4.9571
H  -1.309687 2.960923 5.185001
H  0.191634 2.281416 5.905185
H  0.287101 3.319336 4.429423
Ho -0.721422 2.993301 -0.020753
N  2.187931 3.408898 0.048535
O  3.409349 3.58037 0.082646
O  1.366564 4.330422 0.376353
O  1.673776 2.29754 -0.317128
N  -3.52511 2.425739 -0.79682
O  -4.694395 2.218846 -1.134574
O  -2.843669 3.388767 -1.293778
O  -2.926874 1.694802 0.057614
N  -2.19527 5.304747 1.111069
O  -2.82443 6.27232 1.550257
O  -2.443258 4.111325 1.488854
O  -1.259785 5.442986 0.25142
H  0.637229 -1.235313 3.271881
H  -0.004154 1.393423 -5.208002
C  0.89023 -3.385878 1.750301
H  1.614114 -3.202044 2.56391
H  0.129145 -4.086387 2.146783
H  1.410789 -3.8898 0.918903
C  -0.671186 -4.213494 -0.700964
H  -0.899514 -4.344388 0.36527
H  -1.534764 -4.607213 -1.266097
H  0.193589 -4.858755 -0.954644
C  -0.84003 -3.3677 -3.462577
H  0.068371 -3.891412 -3.822113
H  -1.519206 -4.146985 -3.078106
H  -1.333132 -2.904172 -4.32939
C  0.322438 -1.236023 -5.222498
H  0.967988 -2.07415 -4.911396
H  -0.528358 -1.66043 -5.790298
H  0.888139 -0.591769 -5.918337
elementType: C N O H Ho
totalener: -2098.83520312 hartree
nucrepener: 5521.84959113 hartree
electener: -7620.68479426 hartree
twoeener: 6260.30762846 hartree
cpcmener: -0.10119166 hartree
kineticenergy: 2052.48487884 hartree
exchangeener: -263.482187641146 hartree
correlationener: -10.442308674370 hartree
xcener: -273.924496315516 hartree
chargesum: -0.0000000
charge: -1.204968 -0.278651 0.090062 -0.216015 0.170011 0.069606 -1.909513 -1.978369 0.147923 0.432117 -1.275563 -0.169806 -0.144955 -0.307639 0.835346 -0.911179 0.855028 -1.024702 -1.408734 -1.364162 0.905888 0.130335 0.007320 -0.196794 1.055235 -0.125303 -0.078212 0.049558 0.855471 0.064665 0.146469 -0.236678 1.043788 0.031062 -0.016616 -0.169024 3.074092 0.549934 -0.446950 -0.566629 -0.542749 0.532167 -0.455974 -0.530841 -0.522774 0.543981 -0.451983 -0.545826 -0.543873 -0.078295 -0.095319 0.996376 -0.020810 0.273861 0.244905 1.606635 -0.217170 0.034017 0.236094 1.556292 0.214378 -0.184543 0.020300 0.993356 0.223326 0.247372 -0.016347
charge: -0.090692 0.121128 0.007841 -0.018737 -0.002482 -0.047663 -0.078134 -0.078757 0.007151 -0.007599 -0.093800 -0.054600 -0.013729 0.120799 -0.035105 -0.303771 -0.010021 -0.306000 -0.199942 -0.202512 0.240185 0.024656 0.005715 0.020703 0.247870 0.002525 0.020857 0.029368 0.239141 0.006366 0.024905 0.019636 0.246451 0.028682 0.022018 0.001103 1.530618 -0.369935 -0.047320 -0.167939 -0.165521 -0.365917 -0.049978 -0.162812 -0.163824 -0.372489 -0.052622 -0.155510 -0.164298 0.028199 0.032300 0.159836 0.009917 0.021855 0.009812 0.165638 -0.018166 -0.003477 0.031541 0.167980 0.029174 -0.011909 -0.009127 0.161401 0.008855 0.020941 0.009221
qa: -1.2050 -0.2787 0.0901 -0.2160 0.1700 0.0696 -1.9095 -1.9784 0.1479 0.4321 -1.2756 -0.1698 -0.1450 -0.3076 0.8353 -0.9112 0.8550 -1.0247 -1.4087 -1.3642 0.9059 0.1303 0.0073 -0.1968 1.0552 -0.1253 -0.0782 0.0496 0.8555 0.0647 0.1465 -0.2367 1.0438 0.0311 -0.0166 -0.1690 3.0741 0.5499 -0.4469 -0.5666 -0.5427 0.5322 -0.4560 -0.5308 -0.5228 0.5440 -0.4520 -0.5458 -0.5439 -0.0783 -0.0953 0.9964 -0.0208 0.2739 0.2449 1.6066 -0.2172 0.0340 0.2361 1.5563 0.2144 -0.1845 0.0203 0.9934 0.2233 0.2474 -0.0163
va: 6.1125 3.7291 4.8201 4.4198 4.5828 4.7036 5.8574 5.8981 4.7724 4.2245 6.0654 4.8131 4.2880 3.9037 3.2672 1.5293 3.0388 1.6952 5.5540 5.4538 3.7688 0.8096 1.0423 0.9254 3.5871 1.1187 0.9011 0.8405 3.8122 0.9857 0.8095 0.9550 3.5693 0.8665 0.8856 1.1526 -0.4592 4.0692 1.7735 1.4102 1.4217 4.1201 1.7700 1.2195 1.5097 4.0864 1.7658 1.3408 1.3998 1.4886 1.4466 3.8864 1.0986 0.8351 1.0008 2.4280 1.3867 0.8615 0.8159 2.5510 0.8561 1.1612 1.2178 3.8357 1.0585 0.8862 1.1027
dispersion: -0.100017417 hartree
energy: -2098.935220541332 hartree
dipole: 12.51053 -10.82647 1.68406 -206.79620 196.57998 -10.21622 -65.07400 62.36530 -2.70869
magnitude: 10.70253 au
magnitude: 27.20367 debye
temp: 298.15 k
press: 1.00 atm
zeropoint: 0.48402372 hartree
thermalvibcorrection: 0.04083979 hartree
thermalrotcorrection: 0.00141627 hartree
thermaltrasncorrection: 0.00141627 hartree
thermaltotal: -2098.40752449 hartree
thermalcorr: 0.04367233 hartree
nonthermalcorr: 0.48402372 hartree
totalcorr: 0.52769605 hartree
thermalcorrenthalpy: 0.00094421 hartree
totalenthalpy: -2098.40658028 hartree
vibrat: 0.07513553 hartree
rotat: 0.01792672 hartree
transl: 0.02168548 hartree
total: 0.11474774 hartree
totalentropycorr: -0.11474774 hartree
gibbsenthalpy: -2098.52132802 hartree
gibbsminuselec: 0.41389252 hartree
