program: Orca
programVersion: 5.0.4
elementType: C C C C C N C C C C C N C C C O C O N N C H H H C H H H C H H H C H H H Dy N O O O N O O O N O O O F F F F F F
elementType: Dy
keywords: def2-SVPD def2/JK def2/J def2-SVPD/C PBE rijcosx rhf hcore XYZFile VeryTightSCF freq cpcm(water) D3 defgrid3
charge: 0
multiplicity: 1
frequency: 0.00 0.00 0.00 0.00 0.00 0.00 15.98 24.90 30.59 34.08 37.55 43.52 49.92 51.07 53.15 74.51 83.86 87.54 91.68 96.49 97.70 100.87 103.26 108.32 113.55 115.77 118.98 124.04 128.58 135.38 144.85 153.63 168.30 169.50 170.53 178.37 182.47 187.77 189.38 197.15 200.50 204.02 212.64 228.00 229.97 238.50 243.35 249.76 268.29 275.04 282.35 290.24 294.56 297.82 308.62 317.41 337.11 339.13 354.84 395.53 407.54 422.77 424.45 427.04 429.50 439.37 473.54 482.51 570.92 574.77 582.06 610.66 620.43 620.85 649.56 654.48 672.10 681.21 698.72 701.41 703.15 703.45 730.12 735.68 739.70 744.32 753.13 771.13 772.39 785.12 796.91 797.19 798.58 799.52 827.12 896.31 906.69 988.52 993.56 1044.98 1046.61 1052.55 1054.35 1056.15 1058.51 1071.91 1073.63 1094.30 1120.71 1121.92 1137.72 1155.05 1188.72 1196.58 1240.43 1245.83 1268.39 1273.16 1281.34 1292.54 1322.85 1348.28 1361.40 1375.47 1379.32 1381.64 1384.34 1391.19 1392.29 1394.96 1395.19 1401.74 1402.85 1410.38 1410.67 1418.11 1421.85 1421.93 1441.25 1467.73 1470.88 1472.66 1475.61 1484.83 1499.15 1506.60 1507.73 1549.54 1600.32 1617.96 1629.83 1635.57 1638.64 2980.28 2982.06 2987.56 2990.23 3066.85 3069.49 3071.53 3072.88 3115.40 3116.85 3120.47 3121.47
frequency: 15.98 24.90 30.59 34.08 37.55 43.52 49.92 51.07 53.15 74.51 83.86 87.54 91.68 96.49 97.70 100.87 103.26 108.32 113.55 115.77 118.98 124.04 128.58 135.38 144.85 153.63 168.30 169.50 170.53 178.37 182.47 187.77 189.38 197.15 200.50 204.02 212.64 228.00 229.97 238.50 243.35 249.76 268.29 275.04 282.35 290.24 294.56 297.82 308.62 317.41 337.11 339.13 354.84 395.53 407.54 422.77 424.45 427.04 429.50 439.37 473.54 482.51 570.92 574.77 582.06 610.66 620.43 620.85 649.56 654.48 672.10 681.21 698.72 701.41 703.15 703.45 730.12 735.68 739.70 744.32 753.13 771.13 772.39 785.12 796.91 797.19 798.58 799.52 827.12 896.31 906.69 988.52 993.56 1044.98 1046.61 1052.55 1054.35 1056.15 1058.51 1071.91 1073.63 1094.30 1120.71 1121.92 1137.72 1155.05 1188.72 1196.58 1240.43 1245.83 1268.39 1273.16 1281.34 1292.54 1322.85 1348.28 1361.40 1375.47 1379.32 1381.64 1384.34 1391.19 1392.29 1394.96 1395.19 1401.74 1402.85 1410.38 1410.67 1418.11 1421.85 1421.93 1441.25 1467.73 1470.88 1472.66 1475.61 1484.83 1499.15 1506.60 1507.73 1549.54 1600.32 1617.96 1629.83 1635.57 1638.64 2980.28 2982.06 2987.56 2990.23 3066.85 3069.49 3071.53 3072.88 3115.40 3116.85 3120.47 3121.47
formula: C18H12DyF6N7O11
InChI: InChI=1/C18H12F6N4O2.Dy.3NO3/c1-27(2)17(29)15-11(23)9(21)5-7(19)8(20)6-10(22)12(24)16(18(30)28(3)4)26-14(6)13(5)25-15;;3*2-1(3)4/h1-4H3;;;;/q-4;+10;3*-2/rC18H12DyF6N7O11/c1-26(2)17-15-11(24)9(22)5-7(20)8(21)6-10(23)12(25)16-18(27(3)4)37-19(36-17,38-30(33)39-19,40-31(34)41-19,42-32(35)43-19)28(15)13(5)14(6)29(16)19/h1-4H3
55 atoms
C  -0.370031 -0.469622 -4.067417
C  -0.485503 0.907492 -4.27798
C  -0.322242 -0.983688 -2.751079
C  -0.606296 1.780057 -3.175151
C  -0.404718 -0.01976 -1.698517
N  -0.552182 1.296373 -1.928867
C  -0.14606 -2.364259 -2.404301
C  -0.011148 -2.766455 -1.091018
C  -0.042585 -1.821853 -0.013214
C  -0.26376 -0.443279 -0.319467
C  0.179384 -2.121978 1.350671
N  -0.306862 0.510759 0.621977
C  -0.163782 0.218729 1.916936
C  0.137368 -1.105171 2.309285
C  -0.586676 3.290706 -3.21266
O  0.087429 3.841263 -2.294937
C  -0.217053 1.451609 2.788718
O  0.198912 2.517222 2.248766
N  -1.248635 3.983708 -4.142721
N  -0.706845 1.421035 4.032668
C  -2.300538 3.438485 -4.997242
H  -1.999018 3.476519 -6.059371
H  -2.55385 2.407411 -4.708337
H  -3.20352 4.061048 -4.858871
C  -1.107691 5.43907 -4.163548
H  -0.120926 5.723873 -3.768214
H  -1.214849 5.781806 -5.206804
H  -1.899826 5.905335 -3.54585
C  -1.515619 0.339418 4.591403
H  -1.809412 -0.380167 3.812763
H  -0.974582 -0.17455 5.406018
H  -2.437344 0.788971 5.003359
C  -0.637378 2.636401 4.84381
H  -1.576937 3.213714 4.743427
H  -0.508519 2.339452 5.898947
H  0.210463 3.256841 4.516469
Dy -0.379196 3.049575 -0.038842
N  2.542852 3.140207 -0.035136
O  3.771411 3.17974 -0.017481
O  1.825917 4.142746 0.312608
O  1.903718 2.093982 -0.403374
N  -3.26895 2.673684 -0.487032
O  -4.479496 2.554613 -0.670819
O  -2.559746 3.493499 -1.17157
O  -2.643028 1.9898 0.390327
N  -1.492322 5.618742 0.909097
O  -1.990019 6.684371 1.276484
O  -1.772803 4.508719 1.479823
O  -0.667593 5.555197 -0.064774
F  0.460436 -3.359128 1.75085
F  -0.26337 -1.266033 -5.126486
F  0.427335 -1.415548 3.574355
F  0.165527 -4.066157 -0.83158
F  -0.091707 -3.289136 -3.367966
F  -0.433538 1.365546 -5.530271
elementType: C N O H Dy F
totalener: -2535.77941038 hartree
nucrepener: 6076.78724506 hartree
electener: -8612.56665544 hartree
twoeener: 6989.14648601 hartree
cpcmener: -0.07606674 hartree
kineticenergy: 2488.23908276 hartree
exchangeener: -298.167136700261 hartree
correlationener: -11.127059744767 hartree
xcener: -309.294196445028 hartree
chargesum: -0.0000000
charge: 0.452409 0.372775 0.058739 -0.097874 0.083536 -0.076203 0.322921 0.298891 0.021658 0.380506 0.487598 -0.300633 -0.129142 0.395263 0.855397 -1.036825 0.897703 -1.132434 -1.567860 -1.466142 1.081256 0.043450 -0.071751 -0.115893 1.115968 -0.086083 -0.071807 0.057421 1.015610 -0.037719 0.069294 -0.166120 1.034006 0.053885 -0.051380 -0.078087 3.210002 0.558475 -0.429362 -0.599739 -0.589675 0.527050 -0.437239 -0.516450 -0.509679 0.555256 -0.446473 -0.549353 -0.503058 -0.488706 -0.483271 -0.482914 -0.472920 -0.476276 -0.478002
charge: 0.118243 0.107475 0.046525 0.045513 0.014541 -0.025540 0.097875 0.097451 0.046991 0.009928 0.117084 -0.033597 0.048428 0.107520 -0.043026 -0.288198 -0.010144 -0.293170 -0.195075 -0.196998 0.248615 0.023370 0.008596 0.027626 0.257092 0.009351 0.023061 0.031633 0.248353 0.008631 0.023145 0.027057 0.254843 0.031195 0.023786 0.008157 1.575440 -0.364917 -0.030137 -0.167698 -0.169715 -0.356986 -0.031912 -0.163004 -0.165449 -0.368138 -0.042086 -0.160367 -0.163519 -0.061824 -0.059688 -0.073669 -0.075477 -0.075159 -0.072031
qa: 0.4524 0.3728 0.0587 -0.0979 0.0835 -0.0762 0.3229 0.2989 0.0217 0.3805 0.4876 -0.3006 -0.1291 0.3953 0.8554 -1.0368 0.8977 -1.1324 -1.5679 -1.4661 1.0813 0.0434 -0.0718 -0.1159 1.1160 -0.0861 -0.0718 0.0574 1.0156 -0.0377 0.0693 -0.1661 1.0340 0.0539 -0.0514 -0.0781 3.2100 0.5585 -0.4294 -0.5997 -0.5897 0.5270 -0.4372 -0.5165 -0.5097 0.5553 -0.4465 -0.5494 -0.5031 -0.4887 -0.4833 -0.4829 -0.4729 -0.4763 -0.4780
va: 3.8444 3.0126 4.4652 4.0696 4.8659 4.5477 3.8528 3.8265 4.5912 4.4044 3.8840 4.7457 4.1338 3.1128 3.2658 1.6677 3.0128 1.6490 5.6240 5.5769 3.5950 0.8162 1.0827 0.9159 3.5321 1.0908 0.8979 0.8710 3.6604 1.0523 0.8175 0.9455 3.5994 0.8707 0.9138 1.0995 -0.8946 4.0479 1.7981 1.4580 1.4642 4.1159 1.7941 1.1058 1.4147 4.0651 1.7769 1.3115 1.4015 1.0902 1.0831 0.9792 1.0216 1.0225 0.9531
dispersion: -0.085248302 hartree
energy: -2535.864658680866 hartree
dipole: -24.48085 23.29489 -1.18596 -146.46047 140.37235 -6.08813 -42.74097 41.46017 -1.28080
magnitude: 6.33342 au
magnitude: 16.09828 debye
temp: 298.15 k
press: 1.00 atm
zeropoint: 0.32896874 hartree
thermalvibcorrection: 0.03980169 hartree
thermalrotcorrection: 0.00141627 hartree
thermaltrasncorrection: 0.00141627 hartree
thermaltotal: -2535.49305571 hartree
thermalcorr: 0.04263423 hartree
nonthermalcorr: 0.32896874 hartree
totalcorr: 0.37160297 hartree
thermalcorrenthalpy: 0.00094421 hartree
totalenthalpy: -2535.49211150 hartree
vibrat: 0.07341376 hartree
rotat: 0.01809477 hartree
transl: 0.02177829 hartree
total: 0.11328683 hartree
totalentropycorr: -0.11328683 hartree
gibbsenthalpy: -2535.60539834 hartree
gibbsminuselec: 0.25926034 hartree
