program: Gaussian 09
title: 000004838
version: EM64L-G09RevD.01
frameworkgroup: C1[X(C5H11NO3S)]
method: RPBEPBE
basis: SDD
operation: Freq
keyword: #p
keyword: freq=noraman
keyword: PBEPBE/SDD
title: #p freq=noraman PBEPBE/SDD
converged: YES YES NO NO
title: Mulliken charges:
elementType: S O O O N C C C C C H H H H H H H H H H H
charge: 1.017635 -0.585238 -0.522105 -0.524952 -0.224172 -0.333287 -0.373582 -0.385338 -0.456419 -0.454664 0.309575 0.246059 0.242329 0.228625 0.248219 0.239982 0.222224 0.221477 0.241208 0.267229 0.375196
chargesum: 0.00000
title: Mulliken charges with hydrogens summed into heavy atoms:
elementType: S O O O N C C C C C
charge: 1.017635 -0.210042 -0.522105 -0.524952 0.043057 -0.023713 0.114806 0.091506 0.005787 0.008021
polarizability: 1.33953909e+02 5.76033800e-01 9.34291148e+01 2.02187147e+00 -1.32726934e-01 8.15408804e+01
1716.lowfreq: -13.6482 -7.8730 -0.0023 0.0008 0.0011 12.1184 27.4447 84.2996 111.6145
frequency: 26.8922 84.2838 111.5988 162.6162 176.7806 186.8562 220.3385 259.8949 288.1740 317.7383 336.5853 400.2503 431.3857 449.4207 512.4751 540.2104 606.9120 673.2063 811.2513 817.4951 838.2686 876.1854 898.8837 943.1170 956.6503 961.4852 999.8512 1020.6713 1084.3170 1096.8265 1109.4567 1184.2444 1189.0644 1220.4408 1247.0090 1287.1229 1293.6901 1317.8675 1329.3390 1351.7203 1355.2736 1450.3939 1456.1899 1464.3010 1464.8685 1475.2561 2993.0058 2995.0860 3001.9324 3009.1568 3058.0096 3069.7533 3072.5073 3078.8978 3087.3411 3464.0860 3499.1244
redmass: 4.4017 4.6833 6.2887 1.9725 6.6089 2.9379 1.7855 2.5509 5.9987 7.8790 1.8818 9.5354 2.4693 3.1629 3.1247 7.9391 1.4993 2.5966 1.5023 2.5556 10.3121 2.3400 2.1821 3.9949 1.9741 3.1985 1.8639 1.2895 3.1377 1.1156 1.6391 1.9506 1.5688 1.3116 1.3583 1.2810 1.3306 1.1644 1.1708 1.5292 1.2866 1.1403 1.0894 1.0980 1.1276 1.1000 1.0643 1.0643 1.0604 1.0605 1.0889 1.0994 1.1007 1.1038 1.1025 1.0752 1.0665
irintensity: 0.3050 4.1078 2.8670 28.5400 36.7933 28.7849 1.6378 59.5173 21.2732 11.2732 12.6169 35.8119 18.5508 1.0936 47.4897 136.7349 215.4825 40.5119 0.7641 6.8349 48.5511 9.1350 44.3918 54.5332 54.2673 99.3908 14.0077 68.4674 3.1138 0.0324 4.7233 16.8424 33.2560 17.4813 57.5537 8.3775 25.4664 1.2619 14.5385 0.2466 1.4990 13.9324 13.7415 11.7905 1.1701 11.9704 43.2458 55.5639 7.3333 4.5014 1.0881 30.8421 14.8456 4.8058 24.0977 2.2009 45.2929
temp: 298.150 k
press: 1.00000 atm
elementType: 16 8 8 8 7 6 6 6 6 6 1 1 1 1 1 1 1 1 1 1 1
symmnumber: 1
zpe: 434338.7 jmol-1
zpe.correction: 0.165431 hartree
zpe.thermalcorrener: 0.176948 hartree
zpe.thermalcorrenthalpy: 0.177892 hartree
zpe.thermalcorrgfe: 0.127561 hartree
zpe.sumelectzpe: -874.621520 hartree
zpe.sumelectthermal: -874.610003 hartree
zpe.sumelectthermalent: -874.609059 hartree
zpe.sumelectthermalfe: -874.659390 hartree
dipole: 3.6999 -1.0251 -0.8115
dipole: 3.9241
quadrupole: -73.0880 -68.4368 -70.7705
quadrupole: 6.5616 7.2762 1.3423
quadrupole: -2.3229 2.3283 -0.0054 6.5616 7.2762 1.3423
hfenergy: -874.786951 hartree
pointgroup: C01 [X(C5H11N1O3S1)]
dipole: -1.4730686 -0.3811157 0.2614696 debye
dipolederiv: 1.0651998 -0.0462983 0.0809414 -0.156322 1.3380758 -0.110226 0.1627967 -0.0826183 1.34862 -0.6527406 0.1550152 -0.2939956 0.3406231 -0.7444909 0.225804 -0.454412 0.2014336 -0.7825359 -0.78416 -0.1064151 -0.0189041 -0.2513078 -0.6811423 -0.0222291 0.0442498 -0.0670717 -0.4548213 -0.69901 0.0212011 0.0566013 0.0382901 -0.5028314 -0.1157562 0.2264133 -0.078836 -0.6298154 -1.1719629 -0.002378 -0.0952546 -0.028534 -0.4811949 -0.0100613 0.0521747 -0.008307 -0.1496707 1.0290187 -0.0111077 0.0597394 -0.0229257 0.1024683 -0.0070139 0.1393434 -0.0116543 0.0391417 -0.6732442 -0.0370821 -0.0404447 -0.1904192 -0.0583275 -0.0425869 0.115793 0.0190259 0.0527776 -0.6793012 0.0325349 -0.0251618 0.1530812 -0.0572451 0.0417529 0.1319714 -0.0549937 0.0798827 0.8847562 -0.049423 0.0395346 -0.3275328 0.3140692 -0.0836469 -0.2080206 -0.1872385 0.2610138 0.8845571 0.0521709 0.0364422 0.3788604 0.3114001 0.0882012 -0.1927736 0.1986624 0.2622724 -0.0254899 0.0060085 0.0106434 -0.0020008 0.0365543 -0.0046689 -0.0090327 -0.0041804 -0.0340657 0.0974075 0.0995331 -0.030003 0.049817 -0.0435512 0.0396048 -0.03524 0.065227 0.0579574 0.0952681 -0.0044477 0.0339196 -0.0197127 0.0803655 0.0298162 -0.0049018 -0.0137658 -0.0762181 0.0785081 0.0047023 0.0317797 0.0210522 0.0759656 -0.0255858 0.0053949 0.0325188 -0.1057884 0.1032017 -0.1022707 -0.0317019 -0.030512 -0.041131 -0.0482821 -0.0341748 -0.0628204 0.0565684 -0.0589697 -0.0778999 -0.0375288 -0.0645383 -0.0841207 -0.0510287 -0.0446626 -0.0955257 0.0577452 0.0118602 0.0346355 0.0045992 0.0339393 0.0630727 -0.0079731 0.078274 0.0779795 -0.1492907 0.0158584 -0.038723 0.003147 -0.0395225 0.0636702 0.0196639 0.0758173 -0.0645103 -0.153113 -0.0646501 0.0847215 -0.0352461 0.0662387 -0.0841749 0.0415401 -0.0438362 0.0844514 0.0671874 0.4111132 0.0037526 0.1332856 0.0086713 0.0746605 0.0059229 -0.0321447 0.0014873 -0.014996 0.1327796 -0.0182301 0.1176072 0.0427545 0.3179076 0.0367528 0.0269705 0.0507361 0.2671486 unknown
polarizability: 133.6193322|-0.7861899|93.4332962|4.5912506|-0.3400155|81.8712754 unknown
InChI: InChI=1S/C5H11NO3S/c7-10(8,9)5-1-3-6-4-2-5/h5-7H,1-4H2
charge 0 multiplicity 1
21 atoms
S  1.870723 0.110599 0.02351
O  2.317041 -1.043148 1.44334
O  2.501051 1.57927 0.292434
O  2.213539 -0.631981 -1.37791
N  -2.88896 -0.002713 -0.325765
C  -0.090149 0.047019 0.450825
C  -0.666673 -1.23432 -0.131094
C  -0.731492 1.322489 -0.081071
C  -2.218822 -1.226101 0.143116
C  -2.278092 1.226749 0.202822
H  -0.018067 0.029723 1.552552
H  -0.205297 -2.124477 0.331186
H  -0.485003 -1.279075 -1.221204
H  -0.574297 1.414821 -1.172846
H  -0.308868 2.219869 0.404712
H  -2.674072 -2.105701 -0.344095
H  -2.391553 -1.324267 1.232331
H  -2.445056 1.260335 1.296972
H  -2.779583 2.10684 -0.235611
H  -3.012616 0.01957 -1.34566
H  3.291745 -1.2524 1.368355
