program: Orca
programVersion: 5.0.4
elementType: C C C C C N C C C C C N C C C O C O N N C H H H C H H H C H H H C H H H Lu N O O O N O O O N O O O H H C H H H C H H H C H H H C H H H
elementType: Lu
keywords: def2-SVPD def2/JK def2/J def2-SVPD/C PBE rijcosx rhf hcore XYZFile VeryTightSCF freq cpcm(water) D3 defgrid3
charge: 0
multiplicity: 1
frequency: 0.00 0.00 0.00 0.00 0.00 0.00 20.42 22.94 32.16 34.56 36.83 44.44 53.65 55.10 60.97 65.75 74.34 83.05 86.69 91.55 96.27 105.00 106.58 113.63 114.75 117.04 123.82 127.54 134.74 141.25 144.81 152.19 155.95 158.56 162.75 167.23 173.73 177.87 185.61 188.22 194.79 197.64 207.22 216.03 222.48 228.43 232.43 245.40 250.39 265.55 268.81 271.11 280.83 293.77 307.73 312.49 335.27 341.81 369.38 397.79 399.51 421.83 432.86 443.39 467.11 467.29 477.67 483.00 522.53 533.46 556.55 560.56 596.12 606.56 613.44 623.42 656.89 680.56 685.35 700.20 702.02 703.31 718.32 723.94 737.31 739.22 744.27 753.55 776.32 795.77 796.78 797.28 799.25 807.48 852.25 866.29 870.71 895.98 935.18 966.44 972.61 980.49 982.38 992.56 999.86 1001.72 1004.22 1008.31 1032.66 1046.21 1046.49 1047.12 1059.62 1061.36 1062.81 1072.74 1073.59 1100.31 1118.33 1119.49 1136.78 1141.16 1183.62 1196.64 1230.04 1245.80 1252.04 1279.38 1291.13 1301.10 1307.41 1314.57 1319.22 1323.86 1328.94 1330.96 1336.44 1338.57 1362.70 1373.18 1374.55 1377.14 1381.22 1384.56 1386.59 1389.74 1391.70 1394.03 1395.56 1397.68 1399.49 1402.45 1406.27 1412.54 1414.04 1416.06 1416.43 1419.24 1419.92 1425.48 1436.06 1451.51 1460.51 1466.16 1467.46 1474.03 1491.25 1494.29 1507.73 1551.11 1560.46 1587.78 1589.88 1613.89 1619.45 2975.55 2975.60 2978.95 2979.17 2979.89 2980.38 2981.15 2983.86 3048.68 3056.77 3058.42 3058.52 3058.85 3062.61 3063.58 3065.25 3093.16 3094.56 3110.80 3111.30 3112.55 3119.02 3120.21 3121.99 3146.11 3151.88
frequency: 20.42 22.94 32.16 34.56 36.83 44.44 53.65 55.10 60.97 65.75 74.34 83.05 86.69 91.55 96.27 105.00 106.58 113.63 114.75 117.04 123.82 127.54 134.74 141.25 144.81 152.19 155.95 158.56 162.75 167.23 173.73 177.87 185.61 188.22 194.79 197.64 207.22 216.03 222.48 228.43 232.43 245.40 250.39 265.55 268.81 271.11 280.83 293.77 307.73 312.49 335.27 341.81 369.38 397.79 399.51 421.83 432.86 443.39 467.11 467.29 477.67 483.00 522.53 533.46 556.55 560.56 596.12 606.56 613.44 623.42 656.89 680.56 685.35 700.20 702.02 703.31 718.32 723.94 737.31 739.22 744.27 753.55 776.32 795.77 796.78 797.28 799.25 807.48 852.25 866.29 870.71 895.98 935.18 966.44 972.61 980.49 982.38 992.56 999.86 1001.72 1004.22 1008.31 1032.66 1046.21 1046.49 1047.12 1059.62 1061.36 1062.81 1072.74 1073.59 1100.31 1118.33 1119.49 1136.78 1141.16 1183.62 1196.64 1230.04 1245.80 1252.04 1279.38 1291.13 1301.10 1307.41 1314.57 1319.22 1323.86 1328.94 1330.96 1336.44 1338.57 1362.70 1373.18 1374.55 1377.14 1381.22 1384.56 1386.59 1389.74 1391.70 1394.03 1395.56 1397.68 1399.49 1402.45 1406.27 1412.54 1414.04 1416.06 1416.43 1419.24 1419.92 1425.48 1436.06 1451.51 1460.51 1466.16 1467.46 1474.03 1491.25 1494.29 1507.73 1551.11 1560.46 1587.78 1589.88 1613.89 1619.45 2975.55 2975.60 2978.95 2979.17 2979.89 2980.38 2981.15 2983.86 3048.68 3056.77 3058.42 3058.52 3058.85 3062.61 3063.58 3065.25 3093.16 3094.56 3110.80 3111.30 3112.55 3119.02 3120.21 3121.99 3146.11 3151.88
formula: C22H26LuN7O11
InChI: InChI=1/C22H26N4O2.Lu.3NO3/c1-11-9-15(21(27)25(5)6)23-19-17(11)13(3)14(4)18-12(2)10-16(24-20(18)19)22(28)26(7)8;;3*2-1(3)4/h9-10H,1-8H3;;;;/q-4;+10;3*-2/rC22H26LuN7O11/c1-11-9-15-21(24(5)6)34-23(36-28(31)37-23,38-29(32)39-23,40-30(33)41-23)26(15)19-17(11)13(3)14(4)18-12(2)10-16(27(23)20(18)19)22(35-23)25(7)8/h9-10H,1-8H3
67 atoms
C  -0.150167 -0.412843 -4.046969
C  -0.240492 0.975336 -4.219054
C  -0.410088 -0.947712 -2.737944
C  -0.551445 1.821445 -3.139689
C  -0.549577 0.007989 -1.686283
N  -0.652182 1.336701 -1.896424
C  -0.527993 -2.35767 -2.389909
C  -0.439194 -2.767841 -1.056015
C  -0.208976 -1.792509 -0.000279
C  -0.4420 -0.417573 -0.304996
C  0.253851 -2.071619 1.331444
N  -0.455678 0.55803 0.623584
C  -0.194105 0.263148 1.901214
C  0.232832 -1.027837 2.266124
C  -0.586275 3.326919 -3.170648
O  -0.218811 3.923235 -2.114197
C  -0.232964 1.486893 2.777965
O  -0.103393 2.604148 2.193716
N  -0.969528 4.003796 -4.263144
N  -0.386899 1.411695 4.109495
C  -1.662199 3.424513 -5.412522
H  -0.982665 3.334561 -6.281975
H  -2.08709 2.440981 -5.162264
H  -2.492134 4.100785 -5.684542
C  -0.84997 5.46026 -4.272228
H  -0.076076 5.776418 -3.556792
H  -0.57743 5.781911 -5.292568
H  -1.81723 5.924467 -3.996628
C  -0.823054 0.226891 4.846277
H  -1.331679 -0.487203 4.1813
H  0.029659 -0.264682 5.353321
H  -1.544691 0.554942 5.615216
C  -0.25827 2.629343 4.908018
H  -1.259619 3.035119 5.151918
H  0.261411 2.375542 5.849107
H  0.317012 3.383002 4.350281
Lu -0.744742 2.938983 -0.037435
N  2.123938 3.388501 0.00092
O  3.344138 3.573552 0.011552
O  1.296373 4.300146 0.333732
O  1.614885 2.268287 -0.345473
N  -3.510897 2.370788 -0.850936
O  -4.672628 2.174078 -1.220983
O  -2.826149 3.360691 -1.288918
O  -2.92187 1.606618 -0.022778
N  -2.255531 5.12255 1.193565
O  -2.890028 6.066468 1.674508
O  -2.511588 3.911169 1.492503
O  -1.300074 5.306835 0.362457
H  0.617153 -1.220924 3.273361
H  -0.004441 1.400341 -5.201076
C  0.856931 -3.381111 1.767165
H  1.569494 -3.19877 2.590939
H  0.088347 -4.079507 2.152684
H  1.387995 -3.887051 0.943571
C  -0.678143 -4.214497 -0.700755
H  -0.917845 -4.344542 0.363104
H  -1.532902 -4.614364 -1.274691
H  0.193161 -4.855365 -0.943041
C  -0.83388 -3.37053 -3.46432
H  0.080175 -3.886266 -3.821096
H  -1.508008 -4.155693 -3.083229
H  -1.327399 -2.910151 -4.332552
C  0.314033 -1.227809 -5.224686
H  0.96276 -2.064702 -4.916798
H  -0.537326 -1.653784 -5.790501
H  0.875975 -0.58098 -5.921148
elementType: C N O H Lu
totalener: -2101.16191409 hartree
nucrepener: 5555.08638068 hartree
electener: -7656.24829476 hartree
twoeener: 6295.14742495 hartree
cpcmener: -0.10129502 hartree
kineticenergy: 2053.72002914 hartree
exchangeener: -263.730157542462 hartree
correlationener: -10.451104146344 hartree
xcener: -274.181261688806 hartree
chargesum: -0.0000000
charge: -1.196396 -0.299704 0.059782 -0.210422 0.221969 0.081397 -1.910313 -1.996063 0.118945 0.470970 -1.238423 -0.175379 -0.105863 -0.331367 0.850127 -0.887638 0.875663 -0.997076 -1.394940 -1.363740 0.895000 0.136260 0.013284 -0.204241 1.047728 -0.123530 -0.075912 0.051238 0.851109 0.068199 0.151947 -0.238811 1.045686 0.030399 -0.019515 -0.162470 2.737325 0.561463 -0.448755 -0.524369 -0.493955 0.537541 -0.460974 -0.508778 -0.498922 0.556605 -0.457659 -0.523123 -0.553784 -0.085333 -0.082611 0.990090 -0.021458 0.270003 0.245971 1.618111 -0.211130 0.029765 0.232173 1.563311 0.211361 -0.188107 0.023077 0.994016 0.223201 0.244272 -0.017225
charge: -0.089151 0.123136 0.009233 -0.016455 -0.004254 -0.048947 -0.076671 -0.077287 0.008588 -0.009717 -0.092010 -0.057974 -0.011701 0.123016 -0.033144 -0.301955 -0.008488 -0.303001 -0.199228 -0.201736 0.241887 0.025271 0.006127 0.021085 0.249361 0.002568 0.021482 0.029922 0.240980 0.006608 0.025586 0.020109 0.248387 0.029073 0.022635 0.001291 1.494632 -0.368524 -0.048716 -0.167675 -0.165366 -0.365607 -0.051844 -0.164421 -0.160813 -0.369620 -0.051811 -0.150977 -0.169360 0.027502 0.031476 0.160476 0.009820 0.021816 0.010276 0.166085 -0.017966 -0.003789 0.031683 0.168468 0.029337 -0.012122 -0.009054 0.162016 0.009023 0.021126 0.009303
qa: -1.1964 -0.2997 0.0598 -0.2104 0.2220 0.0814 -1.9103 -1.9961 0.1189 0.4710 -1.2384 -0.1754 -0.1059 -0.3314 0.8501 -0.8876 0.8757 -0.9971 -1.3949 -1.3637 0.8950 0.1363 0.0133 -0.2042 1.0477 -0.1235 -0.0759 0.0512 0.8511 0.0682 0.1519 -0.2388 1.0457 0.0304 -0.0195 -0.1625 2.7373 0.5615 -0.4488 -0.5244 -0.4940 0.5375 -0.4610 -0.5088 -0.4989 0.5566 -0.4577 -0.5231 -0.5538 -0.0853 -0.0826 0.9901 -0.0215 0.2700 0.2460 1.6181 -0.2111 0.0298 0.2322 1.5633 0.2114 -0.1881 0.0231 0.9940 0.2232 0.2443 -0.0172
va: 6.0267 3.6902 4.8576 4.3264 4.4391 4.6882 5.8204 5.8527 4.8238 4.1341 5.9428 4.9233 4.1576 3.8435 3.2193 1.5139 2.9536 1.5801 5.5285 5.4397 3.7764 0.8059 1.0346 0.9311 3.5811 1.1193 0.9016 0.8415 3.8120 0.9783 0.8067 0.9614 3.5613 0.8618 0.8835 1.1621 0.2989 4.0594 1.7679 1.4501 1.3633 4.1257 1.7648 1.1983 1.5035 4.0663 1.7707 1.3564 1.3956 1.5137 1.4679 3.8844 1.1030 0.8413 1.0034 2.3921 1.3883 0.8619 0.8203 2.5229 0.8587 1.1617 1.2187 3.8271 1.0603 0.8908 1.1044
dispersion: -0.100827932 hartree
energy: -2101.262742020014 hartree
dipole: 15.04219 -13.17193 1.87026 -210.75888 200.82241 -9.93647 -66.18962 63.49385 -2.69577
magnitude: 10.46415 au
magnitude: 26.59776 debye
temp: 298.15 k
press: 1.00 atm
zeropoint: 0.48434015 hartree
thermalvibcorrection: 0.04070108 hartree
thermalrotcorrection: 0.00141627 hartree
thermaltrasncorrection: 0.00141627 hartree
thermaltotal: -2100.73486825 hartree
thermalcorr: 0.04353362 hartree
nonthermalcorr: 0.48434015 hartree
totalcorr: 0.52787377 hartree
thermalcorrenthalpy: 0.00094421 hartree
totalenthalpy: -2100.73392404 hartree
vibrat: 0.07475162 hartree
rotat: 0.01790868 hartree
transl: 0.02170484 hartree
total: 0.11436513 hartree
totalentropycorr: -0.11436513 hartree
gibbsenthalpy: -2100.84828918 hartree
gibbsminuselec: 0.41445284 hartree
