program: Orca
programVersion: 5.0.4
elementType: C C C C C N C C C C C N C C C O C O N N C H H H C H H H C H H H C H H H La N O O O N O O O N O O O F F F F H H
elementType: La
keywords: def2-SVPD def2/JK def2/J def2-SVPD/C PBE rijcosx rhf hcore XYZFile VeryTightSCF freq cpcm(water) D3 defgrid3
charge: 0
multiplicity: 1
frequency: 0.00 0.00 0.00 0.00 0.00 0.00 13.65 20.42 22.91 30.73 33.52 34.89 37.92 38.57 54.44 59.93 64.18 66.52 78.22 84.05 86.54 91.57 94.04 97.22 100.01 107.28 109.13 113.42 118.30 124.21 131.54 143.99 155.37 166.44 168.15 175.00 179.36 184.04 194.16 198.87 204.05 208.27 219.05 232.61 241.86 254.38 263.04 269.73 273.74 284.81 287.90 298.45 309.52 313.45 348.92 351.98 399.02 409.99 415.78 427.86 454.41 458.31 481.81 510.72 525.86 541.94 563.86 594.42 608.00 614.91 638.06 655.90 676.04 681.76 684.31 703.91 704.77 705.09 727.54 731.05 734.90 737.47 758.12 762.90 765.39 788.16 798.62 799.21 800.64 857.66 867.46 872.09 878.78 910.93 978.00 995.79 1016.11 1037.90 1044.80 1045.56 1049.29 1051.76 1053.78 1072.19 1073.25 1098.45 1114.04 1120.73 1122.06 1154.10 1163.85 1172.31 1238.88 1243.45 1253.17 1263.74 1271.48 1279.61 1321.07 1335.39 1339.37 1355.97 1373.95 1376.80 1377.49 1383.15 1384.61 1394.37 1395.12 1396.59 1398.79 1405.54 1411.41 1411.77 1414.44 1419.61 1421.59 1456.08 1461.67 1471.22 1475.11 1475.19 1488.63 1507.42 1510.02 1549.44 1596.79 1612.96 1618.65 1625.17 1635.52 2978.21 2978.68 2981.75 2982.19 3061.11 3062.19 3067.52 3067.73 3112.85 3113.50 3119.50 3121.38 3163.99 3164.59
frequency: 13.65 20.42 22.91 30.73 33.52 34.89 37.92 38.57 54.44 59.93 64.18 66.52 78.22 84.05 86.54 91.57 94.04 97.22 100.01 107.28 109.13 113.42 118.30 124.21 131.54 143.99 155.37 166.44 168.15 175.00 179.36 184.04 194.16 198.87 204.05 208.27 219.05 232.61 241.86 254.38 263.04 269.73 273.74 284.81 287.90 298.45 309.52 313.45 348.92 351.98 399.02 409.99 415.78 427.86 454.41 458.31 481.81 510.72 525.86 541.94 563.86 594.42 608.00 614.91 638.06 655.90 676.04 681.76 684.31 703.91 704.77 705.09 727.54 731.05 734.90 737.47 758.12 762.90 765.39 788.16 798.62 799.21 800.64 857.66 867.46 872.09 878.78 910.93 978.00 995.79 1016.11 1037.90 1044.80 1045.56 1049.29 1051.76 1053.78 1072.19 1073.25 1098.45 1114.04 1120.73 1122.06 1154.10 1163.85 1172.31 1238.88 1243.45 1253.17 1263.74 1271.48 1279.61 1321.07 1335.39 1339.37 1355.97 1373.95 1376.80 1377.49 1383.15 1384.61 1394.37 1395.12 1396.59 1398.79 1405.54 1411.41 1411.77 1414.44 1419.61 1421.59 1456.08 1461.67 1471.22 1475.11 1475.19 1488.63 1507.42 1510.02 1549.44 1596.79 1612.96 1618.65 1625.17 1635.52 2978.21 2978.68 2981.75 2982.19 3061.11 3062.19 3067.52 3067.73 3112.85 3113.50 3119.50 3121.38 3163.99 3164.59
formula: C18H14F4LaN7O11
InChI: InChI=1/C18H14F4N4O2.La.3NO3/c1-25(2)17(27)9-5-7(19)11-13(21)14(22)12-8(20)6-10(18(28)26(3)4)24-16(12)15(11)23-9;;3*2-1(3)4/h5-6H,1-4H3;;;;/q-3;+9;3*-2/rC18H14F4LaN7O11/c1-25(2)17-9-5-7(19)11-13(21)14(22)12-8(20)6-10-18(26(3)4)35-23(34-17,36-28(31)37-23,38-29(32)39-23,40-30(33)41-23)27(10)16(12)15(11)24-9/h5-6H,1-4H3
55 atoms
C  -0.332938 -0.437928 -4.088247
C  -0.509804 0.915726 -4.327008
C  -0.2466 -0.953255 -2.768336
C  -0.604842 1.776202 -3.213289
C  -0.337852 0.013497 -1.716402
N  -0.506534 1.330146 -1.955475
C  -0.052778 -2.329158 -2.425345
C  0.059429 -2.735174 -1.111476
C  -0.012818 -1.798585 -0.032349
C  -0.21987 -0.414344 -0.332779
C  0.131338 -2.112505 1.344378
N  -0.296354 0.531174 0.623263
C  -0.21208 0.191096 1.913409
C  0.031013 -1.137746 2.324367
C  -0.662417 3.283535 -3.30497
O  -0.002608 3.921741 -2.434625
C  -0.279978 1.382025 2.841545
O  0.179723 2.473406 2.396072
N  -1.36839 3.896249 -4.263347
N  -0.80431 1.28113 4.070481
C  -2.36014 3.250278 -5.122035
H  -1.983285 3.162342 -6.158907
H  -2.637425 2.25955 -4.73224
H  -3.266315 3.882254 -5.128391
C  -1.293509 5.352173 -4.373265
H  -0.346119 5.71096 -3.943754
H  -1.354501 5.624698 -5.441302
H  -2.141864 5.817448 -3.834362
C  -1.606338 0.160695 4.560953
H  -1.963831 -0.466233 3.730523
H  -1.030653 -0.450548 5.282066
H  -2.487713 0.578422 5.079611
C  -0.728058 2.434818 4.965874
H  -1.67394 3.009493 4.926939
H  -0.575689 2.06553 5.995174
H  0.108407 3.084277 4.66768
La -0.283566 3.212426 0.006488
N  2.789539 3.189442 0.051139
O  4.019283 3.171384 0.098902
O  2.117945 4.219011 0.4124
O  2.118657 2.180352 -0.361947
N  -3.340319 2.876919 -0.201229
O  -4.563778 2.760374 -0.28629
O  -2.67454 3.576773 -1.043795
O  -2.67347 2.306903 0.727476
N  -1.182871 6.041326 0.904913
O  -1.561054 7.160038 1.261461
O  -1.463954 4.992264 1.582689
O  -0.493924 5.87134 -0.157592
F  0.376515 -3.374664 1.711803
F  -0.226005 -1.26878 -5.129706
F  0.242898 -4.037184 -0.858773
F  0.031037 -3.254789 -3.38883
H  0.172268 -1.414918 3.374881
H  -0.538804 1.285391 -5.358205
elementType: C N O H La F
totalener: -2332.15243594 hartree
nucrepener: 5443.97133239 hartree
electener: -7776.12376833 hartree
twoeener: 6277.39246810 hartree
cpcmener: -0.08681251 hartree
kineticenergy: 2288.46426902 hartree
exchangeener: -278.192114297613 hartree
correlationener: -10.522317666867 hartree
xcener: -288.714431964480 hartree
chargesum: -0.0000000
charge: 0.558364 0.139443 0.040153 -0.231239 -0.025662 -0.113374 0.342168 0.328290 0.020133 0.147699 0.566940 -0.299214 -0.108691 0.103015 0.702058 -1.031684 0.659110 -1.032094 -1.435267 -1.356989 0.938007 0.077105 -0.044348 -0.108948 1.056448 -0.107680 -0.065226 0.057924 0.899176 -0.016907 0.080917 -0.137576 1.027409 0.044914 -0.039070 -0.120826 3.865386 0.502262 -0.419500 -0.614090 -0.639743 0.487056 -0.433528 -0.604927 -0.563045 0.497944 -0.440365 -0.618707 -0.569516 -0.511656 -0.510539 -0.477593 -0.481449 -0.002861 0.020392
charge: 0.067458 0.162417 0.038649 -0.015780 0.005361 -0.043618 0.091815 0.091544 0.038880 0.003277 0.066630 -0.045383 -0.013610 0.161647 -0.056467 -0.330320 -0.037693 -0.333145 -0.200392 -0.201079 0.244773 0.026632 0.006643 0.023580 0.251590 0.003933 0.022301 0.030237 0.244309 0.006783 0.026847 0.023052 0.250270 0.030625 0.022872 0.002970 2.019790 -0.386299 -0.041478 -0.194715 -0.201152 -0.377995 -0.044008 -0.193315 -0.194996 -0.388713 -0.052784 -0.192757 -0.190001 -0.087249 -0.085880 -0.081701 -0.081451 0.052414 0.054682
qa: 0.5584 0.1394 0.0402 -0.2312 -0.0257 -0.1134 0.3422 0.3283 0.0201 0.1477 0.5669 -0.2992 -0.1087 0.1030 0.7021 -1.0317 0.6591 -1.0321 -1.4353 -1.3570 0.9380 0.0771 -0.0443 -0.1089 1.0564 -0.1077 -0.0652 0.0579 0.8992 -0.0169 0.0809 -0.1376 1.0274 0.0449 -0.0391 -0.1208 3.8654 0.5023 -0.4195 -0.6141 -0.6397 0.4871 -0.4335 -0.6049 -0.5630 0.4979 -0.4404 -0.6187 -0.5695 -0.5117 -0.5105 -0.4776 -0.4814 -0.0029 0.0204
va: 3.7624 3.8023 4.4907 4.3964 4.9820 5.1952 3.8505 3.8201 4.5534 4.6864 3.7411 5.1662 4.2627 3.8581 3.5140 1.6183 3.4206 1.7110 5.5542 5.5397 3.7334 0.8660 1.0808 0.9137 3.5664 1.1077 0.9147 0.8674 3.7713 1.0596 0.8715 0.9265 3.5881 0.8602 0.9053 1.1207 -1.9052 4.1257 1.7788 1.4820 1.4109 4.1565 1.7663 1.2229 1.3482 4.1444 1.7559 1.3127 1.4214 1.1667 1.1648 1.0276 1.0299 1.3039 1.2970
dispersion: -0.082490402 hartree
energy: -2332.234926340052 hartree
dipole: -30.84332 29.31245 -1.53087 -130.50918 123.58491 -6.92428 -37.10674 35.30557 -1.80116
magnitude: 7.31665 au
magnitude: 18.59744 debye
temp: 298.15 k
press: 1.00 atm
zeropoint: 0.34327057 hartree
thermalvibcorrection: 0.03879478 hartree
thermalrotcorrection: 0.00141627 hartree
thermaltrasncorrection: 0.00141627 hartree
thermaltotal: -2331.85002844 hartree
thermalcorr: 0.04162732 hartree
nonthermalcorr: 0.34327057 hartree
totalcorr: 0.38489790 hartree
thermalcorrenthalpy: 0.00094421 hartree
totalenthalpy: -2331.84908423 hartree
vibrat: 0.07250132 hartree
rotat: 0.01803170 hartree
transl: 0.02166559 hartree
total: 0.11219861 hartree
totalentropycorr: -0.11219861 hartree
gibbsenthalpy: -2331.96128284 hartree
gibbsminuselec: 0.27364350 hartree
