program: Orca
programVersion: 5.0.4
elementType: C C C C C N C C C C C N C C C O C O N N C H H H C H H H C H H H C H H H Sm N O O O N O O O N O O O F F F F H H
elementType: Sm
keywords: def2-SVPD def2/JK def2/J def2-SVPD/C PBE rijcosx rhf hcore XYZFile VeryTightSCF freq cpcm(water) D3 defgrid3
charge: 0
multiplicity: 1
frequency: 0.00 0.00 0.00 0.00 0.00 0.00 16.58 23.79 30.04 31.65 37.20 40.58 46.27 49.00 56.27 72.18 73.97 83.79 84.96 88.15 95.68 101.66 104.65 106.45 110.14 114.75 120.47 123.07 132.21 136.44 146.09 156.01 163.86 168.80 172.13 180.07 187.46 190.91 194.01 199.10 205.40 209.41 226.05 232.98 244.39 253.64 267.65 273.61 279.20 287.68 289.84 299.50 309.70 316.40 350.28 354.90 401.24 416.15 421.65 431.15 458.67 459.95 485.26 514.31 524.93 545.62 568.19 591.80 611.67 616.65 632.95 657.09 678.19 681.95 685.70 702.34 703.85 703.98 732.31 735.50 735.99 739.94 757.62 762.84 764.79 792.84 798.26 798.34 799.65 857.11 862.67 874.63 879.88 912.00 978.71 996.59 1016.96 1040.83 1045.53 1047.89 1051.69 1054.82 1056.64 1071.28 1072.50 1101.39 1115.47 1119.67 1123.22 1153.65 1163.10 1174.01 1239.17 1243.28 1254.05 1270.67 1279.86 1288.42 1321.43 1338.38 1339.70 1357.37 1374.25 1376.67 1377.86 1382.21 1385.38 1394.43 1395.63 1398.68 1400.96 1408.90 1412.48 1412.82 1417.07 1421.29 1424.27 1456.82 1464.92 1473.61 1474.07 1476.49 1492.34 1506.80 1510.40 1551.09 1597.21 1613.74 1618.51 1626.12 1634.73 2978.06 2978.49 2981.56 2982.16 3061.42 3064.09 3068.12 3068.14 3111.59 3111.85 3121.03 3122.62 3165.79 3170.38
frequency: 16.58 23.79 30.04 31.65 37.20 40.58 46.27 49.00 56.27 72.18 73.97 83.79 84.96 88.15 95.68 101.66 104.65 106.45 110.14 114.75 120.47 123.07 132.21 136.44 146.09 156.01 163.86 168.80 172.13 180.07 187.46 190.91 194.01 199.10 205.40 209.41 226.05 232.98 244.39 253.64 267.65 273.61 279.20 287.68 289.84 299.50 309.70 316.40 350.28 354.90 401.24 416.15 421.65 431.15 458.67 459.95 485.26 514.31 524.93 545.62 568.19 591.80 611.67 616.65 632.95 657.09 678.19 681.95 685.70 702.34 703.85 703.98 732.31 735.50 735.99 739.94 757.62 762.84 764.79 792.84 798.26 798.34 799.65 857.11 862.67 874.63 879.88 912.00 978.71 996.59 1016.96 1040.83 1045.53 1047.89 1051.69 1054.82 1056.64 1071.28 1072.50 1101.39 1115.47 1119.67 1123.22 1153.65 1163.10 1174.01 1239.17 1243.28 1254.05 1270.67 1279.86 1288.42 1321.43 1338.38 1339.70 1357.37 1374.25 1376.67 1377.86 1382.21 1385.38 1394.43 1395.63 1398.68 1400.96 1408.90 1412.48 1412.82 1417.07 1421.29 1424.27 1456.82 1464.92 1473.61 1474.07 1476.49 1492.34 1506.80 1510.40 1551.09 1597.21 1613.74 1618.51 1626.12 1634.73 2978.06 2978.49 2981.56 2982.16 3061.42 3064.09 3068.12 3068.14 3111.59 3111.85 3121.03 3122.62 3165.79 3170.38
formula: C18H14F4N7O11Sm
InChI: InChI=1/C18H14F4N4O2.3NO3.Sm/c1-25(2)17(27)9-5-7(19)11-13(21)14(22)12-8(20)6-10(18(28)26(3)4)24-16(12)15(11)23-9;3*2-1(3)4;/h5-6H,1-4H3;;;;/q-4;3*-2;+10/rC18H14F4N7O11Sm/c1-23(2)17-9-5-7(19)11-13(21)14(22)12-8(20)6-10-18(24(3)4)34-41(33-17,35-27(30)36-41,37-28(31)38-41,39-29(32)40-41)25(9)15(11)16(12)26(10)41/h5-6H,1-4H3
55 atoms
C  -0.423672 -0.429509 -4.062334
C  -0.54145 0.931783 -4.29896
C  -0.3702 -0.952606 -2.743968
C  -0.627561 1.792717 -3.184719
C  -0.443515 0.013589 -1.69167
N  -0.575237 1.333695 -1.928532
C  -0.209226 -2.332621 -2.398929
C  -0.091094 -2.737927 -1.084753
C  -0.12493 -1.796789 -0.007429
C  -0.320551 -0.412456 -0.309765
C  0.059896 -2.100384 1.366228
N  -0.361466 0.539826 0.640055
C  -0.237105 0.213908 1.930728
C  0.008852 -1.115561 2.340561
C  -0.605656 3.302265 -3.252916
O  0.013631 3.890343 -2.318911
C  -0.266092 1.4245 2.83553
O  0.065694 2.526891 2.3098
N  -1.192717 3.969175 -4.253858
N  -0.616479 1.338244 4.126669
C  -2.152198 3.399362 -5.198915
H  -1.69551 3.27857 -6.199871
H  -2.542276 2.435744 -4.838195
H  -3.001007 4.101294 -5.282639
C  -1.019514 5.418937 -4.330936
H  -0.090203 5.711239 -3.819603
H  -0.975939 5.707691 -5.395478
H  -1.878849 5.929909 -3.854356
C  -1.285258 0.198571 4.754381
H  -1.785246 -0.431987 4.003682
H  -0.572431 -0.402645 5.350982
H  -2.059348 0.596978 5.433414
C  -0.474438 2.521486 4.974635
H  -1.448789 3.038858 5.072175
H  -0.143182 2.19256 5.975376
H  0.264003 3.209671 4.537447
Sm -0.455523 3.108533 -0.016493
N  2.525887 3.255211 0.052843
O  3.754187 3.314797 0.102048
O  1.787793 4.247294 0.386397
O  1.916686 2.19887 -0.334771
N  -3.387207 2.70045 -0.534448
O  -4.593395 2.56236 -0.742317
O  -2.680325 3.532025 -1.204941
O  -2.772162 2.022368 0.355841
N  -1.624564 5.728521 0.909492
O  -2.139036 6.792108 1.263851
O  -1.900118 4.622187 1.490204
O  -0.790054 5.671366 -0.055865
F  0.304067 -3.361899 1.736554
F  -0.332124 -1.259856 -5.105431
F  0.068187 -4.04255 -0.830087
F  -0.155136 -3.261321 -3.361213
H  0.194352 -1.390594 3.383689
H  -0.52624 1.3018 -5.330062
elementType: C N O H Sm F
totalener: -2335.27925109 hartree
nucrepener: 5508.48134393 hartree
electener: -7843.76059501 hartree
twoeener: 6344.25588017 hartree
cpcmener: -0.08780101 hartree
kineticenergy: 2290.13728181 hartree
exchangeener: -278.540070032808 hartree
correlationener: -10.533932363494 hartree
xcener: -289.074002396301 hartree
chargesum: -0.0000000
charge: 0.585491 -0.003442 0.039165 -0.174237 -0.041340 -0.215445 0.305748 0.290490 -0.026427 0.255884 0.576259 -0.370855 -0.118981 -0.012921 0.790195 -1.115588 0.795541 -1.149440 -1.444666 -1.349948 0.938019 0.095101 -0.034300 -0.137647 1.058360 -0.109843 -0.066808 0.064182 0.880574 0.022926 0.123643 -0.205466 1.022798 0.041843 -0.034081 -0.129520 4.120992 0.542399 -0.418222 -0.625029 -0.656376 0.528596 -0.433794 -0.586458 -0.588820 0.547938 -0.443375 -0.630793 -0.578060 -0.517348 -0.512602 -0.474657 -0.479072 0.010086 0.049332
charge: 0.068819 0.165296 0.040562 -0.004963 0.012207 -0.039720 0.093142 0.092776 0.040710 0.008362 0.067806 -0.043133 0.001359 0.164667 -0.048266 -0.309468 -0.015814 -0.316052 -0.198099 -0.199857 0.244807 0.026756 0.007673 0.023294 0.252227 0.004481 0.022588 0.030856 0.243397 0.009355 0.027212 0.021875 0.250259 0.030875 0.023754 0.002678 1.736131 -0.374584 -0.038150 -0.178272 -0.180135 -0.366958 -0.040897 -0.173146 -0.177531 -0.377736 -0.049477 -0.172064 -0.173016 -0.086871 -0.085221 -0.081163 -0.080783 0.045024 0.052428
qa: 0.5855 -0.0034 0.0392 -0.1742 -0.0413 -0.2154 0.3057 0.2905 -0.0264 0.2559 0.5763 -0.3709 -0.1190 -0.0129 0.7902 -1.1156 0.7955 -1.1494 -1.4447 -1.3499 0.9380 0.0951 -0.0343 -0.1376 1.0584 -0.1098 -0.0668 0.0642 0.8806 0.0229 0.1236 -0.2055 1.0228 0.0418 -0.0341 -0.1295 4.1210 0.5424 -0.4182 -0.6250 -0.6564 0.5286 -0.4338 -0.5865 -0.5888 0.5479 -0.4434 -0.6308 -0.5781 -0.5173 -0.5126 -0.4747 -0.4791 0.0101 0.0493
va: 3.6750 3.7593 4.4991 4.2587 5.0278 5.1396 3.8396 3.7795 4.6357 4.5682 3.6043 5.3232 4.1931 3.9604 3.3384 1.4617 3.0778 1.4613 5.5400 5.4177 3.7363 0.8446 1.0626 0.9212 3.5686 1.1138 0.9071 0.8529 3.7914 0.9991 0.8398 0.9623 3.5796 0.8631 0.9013 1.1361 -2.9899 4.0565 1.7904 1.5395 1.5517 4.0920 1.7913 1.1893 1.4935 4.0689 1.7725 1.4025 1.4780 1.1759 1.1701 1.0244 1.0271 1.3513 1.3059
dispersion: -0.083143621 hartree
energy: -2335.362394706635 hartree
dipole: -19.21550 18.72448 -0.49102 -134.77127 128.21201 -6.55925 -39.73534 38.35751 -1.37783
magnitude: 6.72037 au
magnitude: 17.08182 debye
temp: 298.15 k
press: 1.00 atm
zeropoint: 0.34427209 hartree
thermalvibcorrection: 0.03820765 hartree
thermalrotcorrection: 0.00141627 hartree
thermaltrasncorrection: 0.00141627 hartree
thermaltotal: -2334.97708243 hartree
thermalcorr: 0.04104019 hartree
nonthermalcorr: 0.34427209 hartree
totalcorr: 0.38531228 hartree
thermalcorrenthalpy: 0.00094421 hartree
totalenthalpy: -2334.97613822 hartree
vibrat: 0.07074610 hartree
rotat: 0.01799616 hartree
transl: 0.02168805 hartree
total: 0.11043031 hartree
totalentropycorr: -0.11043031 hartree
gibbsenthalpy: -2335.08656853 hartree
gibbsminuselec: 0.27582618 hartree
