program: Orca
programVersion: 5.0.4
elementType: C C C C C N C C C C C N C C C O C O N N C H H H C H H H C H H H C H H H Eu N O O O N O O O N O O O F F F F H H
elementType: Eu
keywords: def2-SVPD def2/JK def2/J def2-SVPD/C PBE rijcosx rhf hcore XYZFile VeryTightSCF freq cpcm(water) D3 defgrid3
charge: 0
multiplicity: 1
frequency: 0.00 0.00 0.00 0.00 0.00 0.00 17.40 24.26 30.72 32.61 37.52 41.18 47.58 50.27 56.37 73.34 74.90 84.50 87.71 88.93 97.64 102.74 105.99 108.83 112.75 115.26 122.41 124.42 135.70 138.81 146.59 157.13 166.06 168.70 172.00 180.41 186.91 190.64 195.84 199.03 205.39 209.72 226.78 233.03 244.61 253.51 268.22 273.66 279.76 288.24 290.40 299.48 309.70 316.59 350.36 355.16 401.46 416.21 421.95 431.25 459.35 460.34 485.51 514.69 524.97 545.89 568.48 591.75 612.17 616.99 632.78 657.24 678.35 681.98 685.78 701.98 703.63 703.74 733.15 735.69 736.44 740.90 757.65 762.95 764.98 792.80 798.01 798.15 799.52 857.50 863.02 873.94 879.78 912.13 978.91 996.73 1017.01 1041.45 1045.47 1047.99 1052.37 1055.25 1057.19 1071.27 1072.52 1101.90 1115.80 1119.96 1123.57 1153.74 1163.21 1174.34 1239.35 1243.36 1254.40 1272.31 1280.97 1290.16 1321.61 1338.96 1339.90 1357.69 1374.46 1376.58 1377.86 1382.44 1385.65 1394.61 1395.68 1398.93 1401.27 1409.76 1412.54 1413.12 1417.37 1421.47 1424.84 1457.41 1465.94 1473.63 1474.07 1477.41 1493.32 1506.90 1510.63 1551.70 1597.43 1614.09 1619.06 1626.87 1634.49 2978.08 2978.62 2981.57 2982.30 3061.35 3064.23 3067.79 3068.34 3111.58 3112.11 3121.08 3123.14 3165.87 3171.23
frequency: 17.40 24.26 30.72 32.61 37.52 41.18 47.58 50.27 56.37 73.34 74.90 84.50 87.71 88.93 97.64 102.74 105.99 108.83 112.75 115.26 122.41 124.42 135.70 138.81 146.59 157.13 166.06 168.70 172.00 180.41 186.91 190.64 195.84 199.03 205.39 209.72 226.78 233.03 244.61 253.51 268.22 273.66 279.76 288.24 290.40 299.48 309.70 316.59 350.36 355.16 401.46 416.21 421.95 431.25 459.35 460.34 485.51 514.69 524.97 545.89 568.48 591.75 612.17 616.99 632.78 657.24 678.35 681.98 685.78 701.98 703.63 703.74 733.15 735.69 736.44 740.90 757.65 762.95 764.98 792.80 798.01 798.15 799.52 857.50 863.02 873.94 879.78 912.13 978.91 996.73 1017.01 1041.45 1045.47 1047.99 1052.37 1055.25 1057.19 1071.27 1072.52 1101.90 1115.80 1119.96 1123.57 1153.74 1163.21 1174.34 1239.35 1243.36 1254.40 1272.31 1280.97 1290.16 1321.61 1338.96 1339.90 1357.69 1374.46 1376.58 1377.86 1382.44 1385.65 1394.61 1395.68 1398.93 1401.27 1409.76 1412.54 1413.12 1417.37 1421.47 1424.84 1457.41 1465.94 1473.63 1474.07 1477.41 1493.32 1506.90 1510.63 1551.70 1597.43 1614.09 1619.06 1626.87 1634.49 2978.08 2978.62 2981.57 2982.30 3061.35 3064.23 3067.79 3068.34 3111.58 3112.11 3121.08 3123.14 3165.87 3171.23
formula: C18H14EuF4N7O11
InChI: InChI=1/C18H14F4N4O2.Eu.3NO3/c1-25(2)17(27)9-5-7(19)11-13(21)14(22)12-8(20)6-10(18(28)26(3)4)24-16(12)15(11)23-9;;3*2-1(3)4/h5-6H,1-4H3;;;;/q-4;+10;3*-2/rC18H14EuF4N7O11/c1-24(2)17-9-5-7(20)11-13(22)14(23)12-8(21)6-10-18(25(3)4)35-19(34-17,28(31,36-19)37-19,29(32,38-19)39-19,30(33,40-19)41-19)26(9)15(11)16(12)27(10)19/h5-6H,1-4H3
55 atoms
C  -0.424281 -0.42693 -4.060889
C  -0.540317 0.935038 -4.295818
C  -0.373241 -0.952019 -2.74327
C  -0.628649 1.794461 -3.180625
C  -0.448431 0.012998 -1.690583
N  -0.580124 1.333194 -1.925224
C  -0.212433 -2.332192 -2.398131
C  -0.095251 -2.737766 -1.083767
C  -0.129526 -1.796763 -0.006179
C  -0.325376 -0.413064 -0.309233
C  0.055587 -2.098347 1.367868
N  -0.364965 0.540535 0.638721
C  -0.239094 0.217194 1.929646
C  0.005774 -1.112025 2.341054
C  -0.602872 3.304129 -3.242921
O  0.011411 3.88606 -2.301746
C  -0.266045 1.432187 2.828372
O  0.058956 2.532134 2.293126
N  -1.180089 3.976683 -4.245641
N  -0.608141 1.353437 4.12206
C  -2.135924 3.41356 -5.198321
H  -1.673926 3.294883 -6.197083
H  -2.531219 2.450057 -4.843168
H  -2.981817 4.11874 -5.284409
C  -1.000885 5.425865 -4.317499
H  -0.076804 5.713954 -3.794465
H  -0.943518 5.716696 -5.380874
H  -1.864226 5.938894 -3.850484
C  -1.264909 0.213734 4.762145
H  -1.773108 -0.42055 4.020093
H  -0.542379 -0.383615 5.350941
H  -2.030926 0.611773 5.450356
C  -0.46532 2.542344 4.96193
H  -1.443011 3.051224 5.069687
H  -0.117873 2.221647 5.959918
H  0.261061 3.234582 4.511328
Eu -0.470585 3.091636 -0.021199
N  2.496347 3.246503 0.040417
O  3.724724 3.310527 0.08263
O  1.755951 4.236347 0.374806
O  1.888143 2.187314 -0.340436
N  -3.386436 2.679497 -0.54645
O  -4.591843 2.540522 -0.757336
O  -2.679219 3.515959 -1.210659
O  -2.771185 1.998235 0.341043
N  -1.652274 5.686824 0.917371
O  -2.172644 6.745712 1.276812
O  -1.93116 4.573778 1.482873
O  -0.807213 5.64027 -0.039409
F  0.298464 -3.359657 1.740068
F  -0.330267 -1.255667 -5.105099
F  0.064239 -4.042317 -0.829067
F  -0.157409 -3.26058 -3.360605
H  0.192249 -1.386682 3.384025
H  -0.52178 1.306042 -5.326484
elementType: C N O H Eu F
totalener: -2335.87611190 hartree
nucrepener: 5519.93160452 hartree
electener: -7855.80771642 hartree
twoeener: 6356.14761979 hartree
cpcmener: -0.08777627 hartree
kineticenergy: 2290.43197335 hartree
exchangeener: -278.606199793270 hartree
correlationener: -10.536650301031 hartree
xcener: -289.142850094301 hartree
chargesum: 0.0000000
charge: 0.585952 -0.025287 0.035079 -0.176981 -0.059175 -0.209722 0.301547 0.290365 -0.032941 0.255468 0.578327 -0.353927 -0.122252 -0.034228 0.826982 -1.115772 0.812504 -1.145420 -1.447924 -1.347481 0.940784 0.095260 -0.036576 -0.137466 1.059519 -0.110705 -0.067236 0.063820 0.878417 0.026930 0.127618 -0.211411 1.022223 0.041067 -0.030796 -0.131698 4.051042 0.548704 -0.421800 -0.621282 -0.652396 0.533261 -0.434110 -0.576093 -0.581324 0.559789 -0.444444 -0.624221 -0.570296 -0.517977 -0.513900 -0.474157 -0.478450 0.015541 0.057248
charge: 0.069051 0.165766 0.040875 -0.003623 0.012899 -0.038719 0.093356 0.092977 0.041047 0.008845 0.068004 -0.042589 0.003096 0.165222 -0.046681 -0.305859 -0.013552 -0.312993 -0.197892 -0.199490 0.245025 0.026788 0.007624 0.023353 0.252422 0.004570 0.022708 0.030909 0.243506 0.009507 0.027306 0.021767 0.250590 0.030843 0.023941 0.002608 1.688463 -0.372437 -0.037614 -0.175111 -0.176918 -0.365055 -0.039970 -0.169849 -0.174405 -0.375853 -0.048845 -0.168332 -0.170160 -0.086960 -0.085229 -0.081138 -0.080753 0.044578 0.052378
qa: 0.5860 -0.0253 0.0351 -0.1770 -0.0592 -0.2097 0.3015 0.2904 -0.0329 0.2555 0.5783 -0.3539 -0.1223 -0.0342 0.8270 -1.1158 0.8125 -1.1454 -1.4479 -1.3475 0.9408 0.0953 -0.0366 -0.1375 1.0595 -0.1107 -0.0672 0.0638 0.8784 0.0269 0.1276 -0.2114 1.0222 0.0411 -0.0308 -0.1317 4.0510 0.5487 -0.4218 -0.6213 -0.6524 0.5333 -0.4341 -0.5761 -0.5813 0.5598 -0.4444 -0.6242 -0.5703 -0.5180 -0.5139 -0.4742 -0.4784 0.0155 0.0572
va: 3.6682 3.7478 4.4997 4.2458 5.0507 5.0774 3.8293 3.7716 4.6529 4.5729 3.5858 5.3059 4.1832 3.9385 3.2692 1.4699 3.0388 1.4576 5.5398 5.4132 3.7325 0.8442 1.0643 0.9201 3.5711 1.1159 0.9056 0.8509 3.7925 0.9942 0.8362 0.9657 3.5823 0.8629 0.9005 1.1386 -2.8946 4.0519 1.7923 1.5401 1.5998 4.0930 1.7944 1.1936 1.5063 4.0533 1.7741 1.4066 1.4761 1.1760 1.1718 1.0246 1.0266 1.3628 1.3082
dispersion: -0.083047375 hartree
energy: -2335.959159274010 hartree
dipole: -18.07420 17.64853 -0.42567 -135.00876 128.52081 -6.48795 -39.82661 38.46304 -1.36357
magnitude: 6.64334 au
magnitude: 16.88603 debye
temp: 298.15 k
press: 1.00 atm
zeropoint: 0.34442948 hartree
thermalvibcorrection: 0.03812804 hartree
thermalrotcorrection: 0.00141627 hartree
thermaltrasncorrection: 0.00141627 hartree
thermaltotal: -2335.57376921 hartree
thermalcorr: 0.04096058 hartree
nonthermalcorr: 0.34442948 hartree
totalcorr: 0.38539006 hartree
thermalcorrenthalpy: 0.00094421 hartree
totalenthalpy: -2335.57282500 hartree
vibrat: 0.07050425 hartree
rotat: 0.01798956 hartree
transl: 0.02169107 hartree
total: 0.11018488 hartree
totalentropycorr: -0.11018488 hartree
gibbsenthalpy: -2335.68300988 hartree
gibbsminuselec: 0.27614940 hartree
