program: Gaussian 09
title: 000070868
version: EM64L-G09RevD.01
frameworkgroup: C1[X(C18H34N2)]
method: RPBEPBE
basis: SDD
operation: Freq
keyword: #pfreq=noraman
keyword: PBEPBE/SDD
title: #p freq=noraman PBEPBE/SDD
converged: YES YES NO NO
title: Mulliken charges:
elementType: N N C C C C C C C C C C C C C C C C C C H H H H H H H H H H H H H H H H H H H H H H H H H H H H H H H H H H
charge: -0.279472 -0.279473 0.006601 0.006597 -0.438558 -0.460084 -0.438555 -0.460081 -0.068049 -0.068044 -0.432224 -0.432226 -0.496485 -0.478029 -0.478030 -0.496487 -0.431943 -0.431943 -0.417361 -0.417363 0.178779 0.178785 0.232102 0.176056 0.190428 0.193553 0.232102 0.176055 0.190427 0.193554 0.216058 0.216056 0.200472 0.182740 0.182743 0.200470 0.222660 0.209202 0.218796 0.225824 0.225824 0.218797 0.209202 0.222660 0.209043 0.218340 0.209043 0.218339 0.182440 0.205293 0.182440 0.205293 0.233817 0.233818
chargesum: 0.00000
title: Mulliken charges with hydrogens summed into heavy atoms:
elementType: N N C C C C C C C C C C C C C C C C C C
charge: -0.045654 -0.045656 0.185380 0.185382 -0.030399 -0.076102 -0.030398 -0.076100 0.148009 0.148012 -0.049013 -0.049014 -0.064624 -0.033409 -0.033410 -0.064625 -0.004561 -0.004560 -0.029628 -0.029630
polarizability: 2.53839500e+02 1.54432188e-04 2.01981089e+02 -2.90189046e+00 5.75141707e-04 1.62173691e+02
1716.lowfreq: -7.5483 -3.1993 -0.0006 0.0004 0.0011 5.6353 17.1799 32.1681 32.3977
frequency: 17.1782 31.7308 32.3515 38.8698 45.5408 58.1603 80.2101 80.6572 111.5096 112.6366 131.3886 131.5669 142.9964 168.7787 173.3771 212.9563 223.3086 248.8910 264.1066 294.1217 320.2474 383.2617 396.2319 421.2197 421.9371 447.2508 464.5986 489.9392 509.9834 592.6144 639.5944 642.0022 666.2388 669.4688 758.8722 761.4286 771.4893 783.0185 783.2153 784.3176 835.3650 870.4348 871.1452 877.4963 896.1576 896.7606 907.7848 932.4392 934.6476 941.0419 951.2277 957.8560 960.7816 962.4973 964.4839 977.8116 1015.1889 1018.5664 1026.6931 1053.2228 1060.3630 1061.1791 1070.0349 1087.4674 1092.4708 1106.1243 1109.3435 1117.7603 1139.2871 1144.1790 1145.4585 1157.1232 1170.5996 1174.5464 1175.3879 1179.5994 1189.0134 1206.7760 1212.1594 1212.4256 1221.7273 1228.2446 1233.0026 1233.3934 1242.4400 1242.7752 1243.4993 1243.8448 1247.7663 1258.1189 1263.4881 1267.7036 1278.4294 1289.5363 1304.3568 1305.0412 1313.3891 1314.6410 1332.9852 1333.6698 1346.4888 1347.2098 1350.3357 1363.2061 1381.5515 1381.5578 1444.9159 1445.2066 1453.8441 1453.8873 1458.6448 1459.8559 1459.8729 1460.2871 1468.8975 1471.3093 1473.6797 1475.4639 1480.2718 1480.7271 1489.1408 1489.3374 2823.0095 2823.1434 2832.3749 2833.1927 2915.9740 2918.6094 2948.8148 2949.8476 2955.0905 2959.4598 2969.2772 2969.2841 2983.4229 2983.6977 2990.3659 2990.4084 3002.1814 3002.2024 3008.8958 3011.0711 3011.1754 3019.4711 3019.6857 3019.7264 3046.9434 3047.2491 3068.8138 3068.8337 3079.8158 3079.8287 3099.1665 3099.2206 3414.2475 3414.2641
redmass: 4.3108 3.5782 2.9051 3.0158 2.5891 2.7955 3.0455 2.6020 2.4055 3.2804 2.5018 2.1433 2.2420 2.6668 3.4918 2.5835 1.7903 2.1204 3.7980 2.9984 2.9536 2.8239 1.7895 1.9714 1.9713 2.8383 2.4574 3.4673 3.2752 2.0783 1.9143 1.8062 1.3205 1.3564 1.5461 1.3798 2.1723 1.3236 1.3502 1.4939 2.0817 2.2268 2.2957 1.6583 1.5890 1.5983 1.4260 1.8133 1.8506 2.1532 1.9054 1.7342 1.2806 1.8794 2.2761 1.8642 2.3461 2.2143 3.0007 1.1778 2.0057 2.4722 1.8741 2.0329 1.4991 2.7154 2.3495 2.2804 1.7069 3.3777 3.2953 2.0882 1.6641 1.2956 1.5272 1.5747 1.5914 1.3108 1.1572 1.1645 1.4986 1.3903 1.2977 1.2917 1.3234 1.3611 1.2935 1.4981 1.3916 1.3905 1.2937 1.2069 1.3223 1.2139 1.3214 1.2617 1.3091 1.3121 1.4793 1.4148 1.5499 1.5424 1.7467 1.5760 1.5452 1.5558 1.2084 1.2112 1.0882 1.0885 1.0893 1.0840 1.0843 1.0891 1.0843 1.0952 1.0972 1.1007 1.1146 1.1146 1.0909 1.0913 1.0711 1.0710 1.0707 1.0705 1.0804 1.0807 1.0677 1.0586 1.0666 1.0651 1.0831 1.0831 1.0870 1.0867 1.0885 1.0885 1.0586 1.0586 1.0970 1.0577 1.0580 1.0930 1.0656 1.0745 1.0921 1.0979 1.1057 1.1057 1.1066 1.1066 1.1067 1.1067 1.0738 1.0738
irintensity: 0.0323 0.2343 0.0001 0.3419 0.3061 0.0388 0.2157 0.1233 0.0892 2.9965 0.1852 1.4482 3.4578 0.4972 0.0168 0.1865 0.3006 0.5298 0.5250 3.0506 2.3180 0.0636 1.9558 0.7527 0.1658 0.8372 1.5444 0.2021 0.5748 1.5789 10.9504 20.8721 97.2332 45.5428 1.1484 3.8886 0.2455 2.9310 1.1209 0.0288 0.5605 1.6699 4.0395 2.4837 8.5870 0.7493 2.8316 10.4834 3.1271 10.5511 0.3501 0.8777 0.3636 0.7855 2.8208 3.9265 0.0066 0.3631 0.1597 4.3894 2.2405 1.4510 0.0408 54.4743 13.4781 2.1716 0.9780 2.7627 4.1743 87.4261 18.2742 1.8573 0.3039 3.4165 1.1095 5.9667 0.8262 2.5072 0.4597 0.0504 2.5004 3.3921 0.6343 1.1525 2.8907 0.6654 3.9065 6.4103 4.5318 9.4537 0.4328 4.4812 1.4104 2.1045 2.4308 9.5457 17.7545 8.2712 0.1632 0.8081 13.7224 1.1315 0.0639 0.6964 0.2068 1.3278 56.9009 15.4060 14.0519 2.3384 0.5596 1.5316 5.7829 11.4115 14.8003 0.1691 20.8267 5.3489 1.6143 0.7378 9.1055 0.2692 104.7607 0.2030 75.1263 321.3526 26.6310 0.3347 30.4970 27.2867 15.1212 66.1681 3.2281 1.1548 59.4777 0.9262 13.4196 119.1803 62.7209 53.0547 72.8853 116.8125 9.5725 52.8907 44.3404 47.7430 27.9179 50.6953 33.3007 6.9874 24.6255 16.1025 1.7072 188.7518 1.6909 2.3361
temp: 298.150 k
press: 1.00000 atm
elementType: 7 7 6 6 6 6 6 6 6 6 6 6 6 6 6 6 6 6 6 6 1 1 1 1 1 1 1 1 1 1 1 1 1 1 1 1 1 1 1 1 1 1 1 1 1 1 1 1 1 1 1 1 1 1
symmnumber: 1
zpe: 1288154.9 jmol-1
zpe.correction: 0.490632 hartree
zpe.thermalcorrener: 0.512839 hartree
zpe.thermalcorrenthalpy: 0.513783 hartree
zpe.thermalcorrgfe: 0.435913 hartree
zpe.sumelectzpe: -814.112455 hartree
zpe.sumelectthermal: -814.090248 hartree
zpe.sumelectthermalent: -814.089304 hartree
zpe.sumelectthermalfe: -814.167174 hartree
dipole: 0.0001 -1.5043 -0.0001
dipole: 1.5043
quadrupole: -122.9385 -128.4712 -120.4830
quadrupole: -0.0002 4.5537 -0.0005
quadrupole: 1.0257 -4.5069 3.4812 -0.0002 4.5537 -0.0005
hfenergy: -814.6030871 hartree
pointgroup: C01 [X(C18H34N2)]
dipole: 0.000034 -0.5918317 0.0000849 debye
polarizability: 253.8623446|-0.0006892|201.9810875|-2.5152327|-0.0078108|162.1508485 unknown
InChI: InChI=1S/C18H34N2/c1-3-15(4-1)11-19-13-17-7-9-18(10-8-17)14-20-12-16-5-2-6-16/h15-20H,1-14H2
charge 0 multiplicity 1
54 atoms
N  -3.744439 -0.459456 -0.310919
N  3.744524 -0.45945 0.311244
C  -1.4915 -1.552242 -0.219561
C  1.49155 -1.552218 0.220359
C  -0.732364 -0.285405 0.24611
C  -0.737193 -2.82687 0.235392
C  0.73245 -0.285507 -0.245712
C  0.737197 -2.826971 -0.234166
C  -5.865737 0.830912 -0.455257
C  5.865806 0.831015 0.454934
C  -2.957168 -1.569556 0.268267
C  2.957206 -1.569742 -0.267506
C  -7.304675 1.166847 0.079903
C  -5.410037 2.276128 -0.046817
C  5.410014 2.276078 0.046062
C  7.304678 1.166821 -0.080482
C  -6.919772 2.689279 0.073638
C  6.919722 2.689242 -0.074686
C  -5.138534 -0.363202 0.170181
C  5.138571 -0.363333 -0.170021
H  -1.502285 -1.549467 -1.334803
H  1.50236 -1.549078 1.335599
H  -1.271196 0.614401 -0.102618
H  -0.747895 -0.253081 1.357246
H  -0.767273 -2.883514 1.344775
H  -1.254127 -3.731427 -0.144153
H  1.271311 0.614395 0.102724
H  0.74798 -0.253539 -1.356859
H  0.767271 -2.88399 -1.34353
H  1.2541 -3.73142 0.145679
H  -5.879482 0.724303 -1.55956
H  5.879672 0.724777 1.559272
H  -2.974364 -1.45579 1.372153
H  -3.405046 -2.574051 0.046136
H  3.405064 -2.574168 -0.045028
H  2.974361 -1.456376 -1.371434
H  -8.162855 0.859095 -0.541103
H  -7.455138 0.781114 1.105476
H  -4.892202 2.267535 0.928967
H  -4.787984 2.833333 -0.765848
H  4.788015 2.8335 0.764972
H  4.892079 2.267144 -0.929665
H  7.455062 0.780753 -1.105941
H  8.162928 0.859308 0.540545
H  -7.284501 3.204927 -0.832512
H  -7.210778 3.282723 0.956275
H  7.284528 3.205207 0.831252
H  7.210616 3.282399 -0.957553
H  -5.73207 -1.29666 -0.022384
H  -5.111068 -0.231648 1.271409
H  5.732146 -1.296711 0.022809
H  5.110993 -0.232163 -1.271292
H  -3.705199 -0.473525 -1.3410
H  3.70538 -0.473175 1.341332
