program: Orca
programVersion: 5.0.4
elementType: C C C C C N C C C C C N C C C O C O N N C H H H C H H H C H H H C H H H Tb N O O O N O O O N O O O F F F F F F
elementType: Tb
keywords: def2-SVPD def2/JK def2/J def2-SVPD/C PBE rijcosx rhf hcore XYZFile VeryTightSCF freq cpcm(water) D3 defgrid3
charge: 0
multiplicity: 1
frequency: 0.00 0.00 0.00 0.00 0.00 0.00 15.62 24.79 30.19 33.73 37.21 43.13 49.17 50.68 51.95 73.87 82.87 87.30 90.49 95.52 96.43 100.75 102.02 107.38 112.23 114.06 118.19 123.59 126.71 133.49 142.10 152.58 168.25 169.19 170.80 177.30 181.40 187.85 189.52 196.82 201.21 204.50 212.35 227.75 229.95 237.83 242.70 249.24 267.88 275.12 282.25 290.09 294.60 297.41 308.57 317.09 336.50 338.95 354.67 395.01 406.89 422.60 424.29 426.67 429.44 439.14 473.07 482.22 570.97 574.22 581.55 610.52 620.28 620.91 649.62 654.35 671.98 681.24 698.59 701.60 703.37 703.49 730.41 734.87 738.87 743.47 753.10 771.29 772.19 784.86 797.06 797.38 798.69 799.46 826.91 896.14 906.54 988.43 993.43 1044.91 1046.36 1051.91 1053.85 1055.54 1057.84 1071.83 1073.50 1094.25 1120.70 1121.96 1137.51 1154.84 1188.42 1196.37 1240.34 1245.75 1268.09 1271.57 1279.87 1290.46 1322.61 1347.85 1361.31 1375.37 1379.16 1381.47 1384.19 1391.04 1392.10 1394.81 1395.11 1401.64 1402.61 1410.34 1410.64 1417.47 1421.50 1421.86 1441.00 1467.52 1470.83 1472.29 1475.57 1484.06 1498.44 1506.60 1507.60 1549.23 1600.14 1617.77 1629.41 1635.48 1638.60 2980.20 2982.09 2987.51 2990.06 3066.86 3069.35 3071.43 3072.75 3115.17 3116.66 3120.28 3121.73
frequency: 15.62 24.79 30.19 33.73 37.21 43.13 49.17 50.68 51.95 73.87 82.87 87.30 90.49 95.52 96.43 100.75 102.02 107.38 112.23 114.06 118.19 123.59 126.71 133.49 142.10 152.58 168.25 169.19 170.80 177.30 181.40 187.85 189.52 196.82 201.21 204.50 212.35 227.75 229.95 237.83 242.70 249.24 267.88 275.12 282.25 290.09 294.60 297.41 308.57 317.09 336.50 338.95 354.67 395.01 406.89 422.60 424.29 426.67 429.44 439.14 473.07 482.22 570.97 574.22 581.55 610.52 620.28 620.91 649.62 654.35 671.98 681.24 698.59 701.60 703.37 703.49 730.41 734.87 738.87 743.47 753.10 771.29 772.19 784.86 797.06 797.38 798.69 799.46 826.91 896.14 906.54 988.43 993.43 1044.91 1046.36 1051.91 1053.85 1055.54 1057.84 1071.83 1073.50 1094.25 1120.70 1121.96 1137.51 1154.84 1188.42 1196.37 1240.34 1245.75 1268.09 1271.57 1279.87 1290.46 1322.61 1347.85 1361.31 1375.37 1379.16 1381.47 1384.19 1391.04 1392.10 1394.81 1395.11 1401.64 1402.61 1410.34 1410.64 1417.47 1421.50 1421.86 1441.00 1467.52 1470.83 1472.29 1475.57 1484.06 1498.44 1506.60 1507.60 1549.23 1600.14 1617.77 1629.41 1635.48 1638.60 2980.20 2982.09 2987.51 2990.06 3066.86 3069.35 3071.43 3072.75 3115.17 3116.66 3120.28 3121.73
formula: C18H12F6N7O11Tb
InChI: InChI=1/C18H12F6N4O2.3NO3.Tb/c1-27(2)17(29)15-11(23)9(21)5-7(19)8(20)6-10(22)12(24)16(18(30)28(3)4)26-14(6)13(5)25-15;3*2-1(3)4;/h1-4H3;;;;/q-4;3*-2;+10/rC18H12F6N7O11Tb/c1-25(2)17-15-11(23)9(21)5-7(19)8(20)6-10(22)12(24)16-18(26(3)4)36-43(35-17,37-29(32)38-43,39-30(33)40-43,41-31(34)42-43)27(15)13(5)14(6)28(16)43/h1-4H3
55 atoms
C  -0.364718 -0.470369 -4.069109
C  -0.483172 0.906221 -4.280568
C  -0.313589 -0.9833 -2.752428
C  -0.601708 1.779346 -3.178082
C  -0.394939 -0.018811 -1.700021
N  -0.543275 1.297215 -1.93137
C  -0.136973 -2.363826 -2.405966
C  -0.002678 -2.766196 -1.092783
C  -0.035556 -1.821839 -0.014873
C  -0.25521 -0.4427 -0.320526
C  0.182038 -2.123851 1.349329
N  -0.300264 0.510336 0.622177
C  -0.161703 0.216066 1.917224
C  0.136953 -1.108445 2.309092
C  -0.587478 3.290128 -3.219559
O  0.093231 3.846137 -2.310084
C  -0.218148 1.445974 2.793283
O  0.207031 2.512441 2.262065
N  -1.261946 3.9771 -4.145126
N  -0.720664 1.411679 4.032027
C  -2.318351 3.423439 -4.988606
H  -2.026645 3.460531 -6.053518
H  -2.562601 2.391482 -4.694957
H  -3.223885 4.040763 -4.843598
C  -1.128631 5.433069 -4.172066
H  -0.139721 5.72423 -3.786801
H  -1.247023 5.771665 -5.215477
H  -1.917484 5.897525 -3.548827
C  -1.53721 0.329601 4.578339
H  -1.822977 -0.387621 3.794522
H  -1.005854 -0.187305 5.397468
H  -2.462986 0.77905 4.981252
C  -0.656243 2.623233 4.849217
H  -1.595105 3.201046 4.745313
H  -0.534451 2.321337 5.903815
H  0.193874 3.244891 4.530274
Tb -0.36292 3.063626 -0.035002
N  2.572218 3.139456 -0.033971
O  3.80101 3.172225 -0.01721
O  1.861658 4.146161 0.315768
O  1.927534 2.096907 -0.403077
N  -3.266221 2.692111 -0.468511
O  -4.47798 2.574217 -0.644924
O  -2.559036 3.503583 -1.165073
O  -2.638157 2.014758 0.41268
N  -1.463892 5.653989 0.905364
O  -1.955441 6.723912 1.268408
O  -1.746193 4.548993 1.485292
O  -0.644441 5.581606 -0.072542
F  0.460453 -3.361813 1.748843
F  -0.259991 -1.267632 -5.127777
F  0.421159 -1.420399 3.575113
F  0.173477 -4.065984 -0.833423
F  -0.08214 -3.288591 -3.369719
F  -0.438437 1.363566 -5.533429
elementType: C N O H Tb F
totalener: -2535.19398474 hartree
nucrepener: 6067.35663372 hartree
electener: -8602.55061847 hartree
twoeener: 6979.29902686 hartree
cpcmener: -0.07609415 hartree
kineticenergy: 2487.93893773 hartree
exchangeener: -298.103250750231 hartree
correlationener: -11.124587255782 hartree
xcener: -309.227838006014 hartree
chargesum: 0.0000000
charge: 0.448259 0.388782 0.070043 -0.125580 0.068501 -0.165727 0.318451 0.304575 0.015655 0.373887 0.481917 -0.335268 -0.155065 0.404836 0.877873 -1.111686 0.898383 -1.168111 -1.578966 -1.463957 1.084418 0.043619 -0.071251 -0.113733 1.114332 -0.087570 -0.068914 0.058562 1.014608 -0.038369 0.066793 -0.163050 1.037098 0.052956 -0.051661 -0.080300 3.627579 0.557169 -0.426392 -0.610236 -0.625237 0.525454 -0.433839 -0.544849 -0.535317 0.562464 -0.444774 -0.581524 -0.532044 -0.489233 -0.484303 -0.482830 -0.472697 -0.476174 -0.477557
charge: 0.118060 0.106893 0.046108 0.044303 0.014074 -0.026052 0.097697 0.097275 0.046572 0.009664 0.116932 -0.033419 0.047136 0.106916 -0.044294 -0.290248 -0.011693 -0.295856 -0.195478 -0.197291 0.248494 0.023370 0.008566 0.027577 0.256850 0.009180 0.023011 0.031421 0.248349 0.008586 0.023202 0.027047 0.254742 0.031165 0.023809 0.007844 1.610039 -0.366314 -0.030803 -0.169493 -0.172026 -0.358088 -0.032624 -0.165202 -0.167735 -0.369588 -0.042633 -0.162670 -0.165413 -0.061822 -0.059752 -0.073640 -0.075495 -0.075180 -0.072070
qa: 0.4483 0.3888 0.0700 -0.1256 0.0685 -0.1657 0.3185 0.3046 0.0157 0.3739 0.4819 -0.3353 -0.1551 0.4048 0.8779 -1.1117 0.8984 -1.1681 -1.5790 -1.4640 1.0844 0.0436 -0.0713 -0.1137 1.1143 -0.0876 -0.0689 0.0586 1.0146 -0.0384 0.0668 -0.1631 1.0371 0.0530 -0.0517 -0.0803 3.6276 0.5572 -0.4264 -0.6102 -0.6252 0.5255 -0.4338 -0.5448 -0.5353 0.5625 -0.4448 -0.5815 -0.5320 -0.4892 -0.4843 -0.4828 -0.4727 -0.4762 -0.4776
va: 3.8478 3.0211 4.4453 4.1345 4.8934 4.5294 3.8547 3.8305 4.5945 4.4272 3.8855 4.7582 4.1707 3.1211 3.2582 1.6243 3.0230 1.5688 5.6272 5.5782 3.5888 0.8178 1.0833 0.9146 3.5296 1.0950 0.8984 0.8731 3.6608 1.0539 0.8199 0.9439 3.5943 0.8698 0.9143 1.1037 -1.9321 4.0459 1.8011 1.4980 1.5511 4.1117 1.7981 1.1169 1.4397 4.0489 1.7801 1.3493 1.4377 1.0903 1.0840 0.9782 1.0216 1.0228 0.9522
dispersion: -0.084403087 hartree
energy: -2535.278387828854 hartree
dipole: -25.64387 24.38132 -1.26255 -143.85510 137.71610 -6.13899 -41.92335 40.63262 -1.29073
magnitude: 6.39900 au
magnitude: 16.26497 debye
temp: 298.15 k
press: 1.00 atm
zeropoint: 0.32884569 hartree
thermalvibcorrection: 0.03986006 hartree
thermalrotcorrection: 0.00141627 hartree
thermaltrasncorrection: 0.00141627 hartree
thermaltotal: -2534.90684953 hartree
thermalcorr: 0.04269261 hartree
nonthermalcorr: 0.32884569 hartree
totalcorr: 0.37153830 hartree
thermalcorrenthalpy: 0.00094421 hartree
totalenthalpy: -2534.90590532 hartree
vibrat: 0.07357859 hartree
rotat: 0.01809901 hartree
transl: 0.02177178 hartree
total: 0.11344938 hartree
totalentropycorr: -0.11344938 hartree
gibbsenthalpy: -2535.01935470 hartree
gibbsminuselec: 0.25903313 hartree
