program: Orca
programVersion: 5.0.4
elementType: C C C C C N C C C C C N C C C O C O N N C H H H C H H H C H H H C H H H Yb N O O O N O O O N O O O F F F F F F
elementType: Yb
keywords: def2-SVPD def2/JK def2/J def2-SVPD/C PBE rijcosx rhf hcore XYZFile VeryTightSCF freq cpcm(water) D3 defgrid3
charge: 0
multiplicity: 1
frequency: 0.00 0.00 0.00 0.00 0.00 0.00 17.49 25.36 31.53 35.48 39.26 45.28 50.74 54.15 57.03 76.07 85.43 88.25 92.86 96.40 100.02 104.33 107.30 111.47 118.89 121.83 123.18 125.56 134.71 142.09 152.64 156.85 163.66 166.50 172.35 182.20 184.01 187.13 193.41 198.33 200.34 202.47 214.90 228.82 230.30 241.22 245.97 252.26 269.88 275.21 282.73 291.12 294.53 299.46 308.87 318.71 339.62 340.24 355.62 396.78 409.71 423.45 425.16 428.43 429.98 440.16 475.53 483.65 570.37 577.20 583.73 611.50 620.43 620.89 649.74 655.08 672.76 681.54 698.59 700.73 702.21 703.06 729.64 738.34 742.29 747.18 754.15 771.35 772.92 786.48 796.07 796.50 797.92 799.42 827.75 896.82 907.23 988.58 993.84 1045.21 1046.95 1054.50 1056.02 1057.90 1060.50 1072.11 1073.55 1094.39 1120.58 1121.67 1138.37 1155.62 1189.49 1197.00 1240.48 1245.87 1269.02 1278.61 1285.87 1299.17 1323.23 1349.14 1361.01 1375.55 1379.34 1381.88 1384.63 1391.38 1392.81 1394.96 1395.25 1401.95 1403.69 1410.36 1410.64 1419.90 1422.72 1423.08 1441.89 1468.18 1470.61 1473.52 1475.70 1487.74 1501.66 1506.28 1508.32 1550.53 1600.42 1618.50 1630.92 1635.60 1638.92 2980.44 2981.87 2987.69 2990.67 3066.94 3069.36 3071.87 3072.75 3115.91 3118.06 3120.54 3121.13
frequency: 17.49 25.36 31.53 35.48 39.26 45.28 50.74 54.15 57.03 76.07 85.43 88.25 92.86 96.40 100.02 104.33 107.30 111.47 118.89 121.83 123.18 125.56 134.71 142.09 152.64 156.85 163.66 166.50 172.35 182.20 184.01 187.13 193.41 198.33 200.34 202.47 214.90 228.82 230.30 241.22 245.97 252.26 269.88 275.21 282.73 291.12 294.53 299.46 308.87 318.71 339.62 340.24 355.62 396.78 409.71 423.45 425.16 428.43 429.98 440.16 475.53 483.65 570.37 577.20 583.73 611.50 620.43 620.89 649.74 655.08 672.76 681.54 698.59 700.73 702.21 703.06 729.64 738.34 742.29 747.18 754.15 771.35 772.92 786.48 796.07 796.50 797.92 799.42 827.75 896.82 907.23 988.58 993.84 1045.21 1046.95 1054.50 1056.02 1057.90 1060.50 1072.11 1073.55 1094.39 1120.58 1121.67 1138.37 1155.62 1189.49 1197.00 1240.48 1245.87 1269.02 1278.61 1285.87 1299.17 1323.23 1349.14 1361.01 1375.55 1379.34 1381.88 1384.63 1391.38 1392.81 1394.96 1395.25 1401.95 1403.69 1410.36 1410.64 1419.90 1422.72 1423.08 1441.89 1468.18 1470.61 1473.52 1475.70 1487.74 1501.66 1506.28 1508.32 1550.53 1600.42 1618.50 1630.92 1635.60 1638.92 2980.44 2981.87 2987.69 2990.67 3066.94 3069.36 3071.87 3072.75 3115.91 3118.06 3120.54 3121.13
formula: C18H12F6N7O11Yb
InChI: InChI=1/C18H12F6N4O2.3NO3.Yb/c1-27(2)17(29)15-11(23)9(21)5-7(19)8(20)6-10(22)12(24)16(18(30)28(3)4)26-14(6)13(5)25-15;3*2-1(3)4;/h1-4H3;;;;/q-4;3*-2;+10/rC18H12F6N7O11Yb/c1-25(2)17-15-11(23)9(21)5-7(19)8(20)6-10(22)12(24)16-18(26(3)4)36-43(35-17,29(32,37-43)38-43,30(33,39-43)40-43,31(34,41-43)42-43)27(15)13(5)14(6)28(16)43/h1-4H3
55 atoms
C  -0.384955 -0.466922 -4.063647
C  -0.491725 0.911911 -4.271026
C  -0.347471 -0.984998 -2.7488
C  -0.620018 1.782546 -3.16728
C  -0.433412 -0.022825 -1.695668
N  -0.578148 1.293866 -1.922045
C  -0.173472 -2.365911 -2.40113
C  -0.037999 -2.768049 -1.087531
C  -0.066098 -1.823001 -0.009766
C  -0.290113 -0.445938 -0.317822
C  0.165747 -2.1172 1.353665
N  -0.326958 0.511469 0.619301
C  -0.173345 0.226633 1.914517
C  0.13202 -1.096118 2.308776
C  -0.586423 3.292997 -3.1901
O  0.060642 3.825674 -2.242767
C  -0.216895 1.470145 2.771226
O  0.167834 2.53147 2.200683
N  -1.205255 4.005213 -4.135165
N  -0.66259 1.454537 4.032041
C  -2.237683 3.486546 -5.029008
H  -1.899951 3.524786 -6.080159
H  -2.521997 2.459424 -4.75549
H  -3.132016 4.126607 -4.916883
C  -1.041608 5.45844 -4.13461
H  -0.064427 5.723434 -3.703424
H  -1.108729 5.814284 -5.176796
H  -1.84662 5.930023 -3.537957
C  -1.446681 0.377139 4.632917
H  -1.767515 -0.35161 3.873846
H  -0.874837 -0.126343 5.432887
H  -2.353631 0.829584 5.073531
C  -0.574326 2.682296 4.822514
H  -1.520091 3.252885 4.744712
H  -0.40903 2.401584 5.877048
H  0.258621 3.302644 4.458822
Yb -0.43053 3.005657 -0.051634
N  2.444296 3.144305 -0.037541
O  3.671917 3.204596 -0.015843
O  1.706756 4.132614 0.304276
O  1.822043 2.087735 -0.404668
N  -3.273015 2.610173 -0.534556
O  -4.479313 2.485039 -0.73989
O  -2.559362 3.453185 -1.185897
O  -2.651036 1.911862 0.333122
N  -1.583419 5.500226 0.925312
O  -2.099583 6.55083 1.310564
O  -1.853483 4.373293 1.465767
O  -0.747003 5.466673 -0.039542
F  0.45142 -3.352474 1.756707
F  -0.27088 -1.260123 -5.124355
F  0.43763 -1.402898 3.571077
F  0.13824 -4.067744 -0.827789
F  -0.118982 -3.290783 -3.364807
F  -0.421944 1.371544 -5.521852
elementType: C N O H Yb F
totalener: -2538.10767087 hartree
nucrepener: 6108.90943399 hartree
electener: -8647.01710486 hartree
twoeener: 7022.88527279 hartree
cpcmener: -0.07573596 hartree
kineticenergy: 2489.45342154 hartree
exchangeener: -298.415244649121 hartree
correlationener: -11.136127595881 hartree
xcener: -309.551372245002 hartree
chargesum: -0.0000000
charge: 0.471162 0.377988 0.053010 -0.071778 0.140087 -0.063306 0.313237 0.282107 0.026424 0.405684 0.499726 -0.297643 -0.082108 0.380946 0.843254 -0.935956 0.919524 -1.087240 -1.557403 -1.479047 1.079935 0.046840 -0.074433 -0.119486 1.102139 -0.083306 -0.079072 0.065264 1.016836 -0.038226 0.074807 -0.169094 1.040642 0.050624 -0.050245 -0.082667 2.687747 0.569044 -0.429607 -0.559288 -0.531713 0.542406 -0.441878 -0.481109 -0.488513 0.563821 -0.450178 -0.514242 -0.488431 -0.487863 -0.482426 -0.488098 -0.472978 -0.476174 -0.489748
charge: 0.119327 0.109688 0.047869 0.047822 0.014241 -0.025208 0.098889 0.098431 0.048422 0.008738 0.118010 -0.036095 0.051049 0.109820 -0.040332 -0.286213 -0.006529 -0.289463 -0.193763 -0.196157 0.249778 0.023577 0.008966 0.028051 0.258658 0.009773 0.023630 0.032528 0.249286 0.008875 0.023204 0.027296 0.256140 0.031448 0.024250 0.008775 1.514385 -0.362120 -0.028669 -0.166675 -0.167515 -0.355097 -0.030092 -0.160918 -0.162878 -0.365380 -0.040703 -0.157351 -0.162482 -0.061863 -0.059457 -0.073709 -0.075345 -0.075055 -0.071857
qa: 0.4712 0.3780 0.0530 -0.0718 0.1401 -0.0633 0.3132 0.2821 0.0264 0.4057 0.4997 -0.2976 -0.0821 0.3809 0.8433 -0.9360 0.9195 -1.0872 -1.5574 -1.4790 1.0799 0.0468 -0.0744 -0.1195 1.1021 -0.0833 -0.0791 0.0653 1.0168 -0.0382 0.0748 -0.1691 1.0406 0.0506 -0.0502 -0.0827 2.6877 0.5690 -0.4296 -0.5593 -0.5317 0.5424 -0.4419 -0.4811 -0.4885 0.5638 -0.4502 -0.5142 -0.4884 -0.4879 -0.4824 -0.4881 -0.4730 -0.4762 -0.4897
va: 3.8174 3.0105 4.4902 3.9870 4.6990 4.5821 3.8432 3.8240 4.5910 4.3281 3.8668 4.7545 4.0090 3.1066 3.2599 1.6243 2.9587 1.6271 5.6181 5.5456 3.5959 0.8144 1.0820 0.9223 3.5478 1.0832 0.8997 0.8622 3.6632 1.0524 0.8151 0.9505 3.5881 0.8740 0.9089 1.1017 0.3759 4.0434 1.7931 1.4617 1.3631 4.1088 1.7919 1.0871 1.3905 4.0591 1.7818 1.2690 1.4069 1.0860 1.0798 0.9858 1.0202 1.0218 0.9669
dispersion: -0.084761411 hartree
energy: -2538.192432283977 hartree
dipole: -20.53055 19.60378 -0.92677 -153.49707 147.60358 -5.89349 -44.79732 43.52310 -1.27422
magnitude: 6.10047 au
magnitude: 15.50617 debye
temp: 298.15 k
press: 1.00 atm
zeropoint: 0.32935829 hartree
thermalvibcorrection: 0.03961032 hartree
thermalrotcorrection: 0.00141627 hartree
thermaltrasncorrection: 0.00141627 hartree
thermaltotal: -2537.82063112 hartree
thermalcorr: 0.04244287 hartree
nonthermalcorr: 0.32935829 hartree
totalcorr: 0.37180116 hartree
thermalcorrenthalpy: 0.00094421 hartree
totalenthalpy: -2537.81968692 hartree
vibrat: 0.07286090 hartree
rotat: 0.01808041 hartree
transl: 0.02179733 hartree
total: 0.11273864 hartree
totalentropycorr: -0.11273864 hartree
gibbsenthalpy: -2537.93242556 hartree
gibbsminuselec: 0.26000673 hartree
