program: Orca
programVersion: 5.0.2
elementType: Cl S F F F O O O O O O N N C C C C C C C C C C C C C C C H H H H H H H H H
charge: -1
multiplicity: 1
keywords: wb97x-d3
keywords: def2-TZVPP
keywords: def2/J RIJCOSX
keywords: DEFGRID2
keywords: scfconv7
keywords: smallprint printgap noloewdin
keywords: NOSOSCF
formula: C15H9ClF3N2O6S
InChI: InChI=1/C15H9ClF3N2O6S/c1-28(25,26)20-14(22)10-7-9(3-4-12(10)21(23)24)27-13-5-2-8(6-11(13)16)15(17,18)19/h2-7H,1H3
37 atoms
Cl -3.090329 3.27713 1.449658
S  2.824155 -2.477745 0.202285
F  -5.526912 -0.386516 -2.309727
F  -5.289394 -2.034889 -0.954976
F  -6.441054 -0.316917 -0.365445
O  -0.689465 1.803625 0.923423
O  4.082082 0.123692 2.545917
O  1.360964 -2.442865 0.36486
O  3.304957 -2.071075 -1.129099
O  4.499504 0.693238 -2.286759
O  5.203638 0.246852 -0.323778
N  3.60806 -1.759137 1.407295
N  4.33654 0.580524 -1.094972
C  2.670413 0.4121 0.70644
C  0.54453 1.488081 0.41678
C  3.025265 0.879275 -0.553388
C  1.40968 0.73825 1.189383
C  3.53797 -0.444939 1.604933
C  -1.771668 1.156738 0.437566
C  0.907426 1.949461 -0.84031
C  2.161164 1.642703 -1.326231
C  -4.09992 -0.06477 -0.471045
C  -3.012286 1.76085 0.633205
C  -1.708325 -0.070822 -0.208676
C  -4.171597 1.158197 0.183069
C  -2.86717 -0.674465 -0.663037
C  3.339173 -4.157399 0.453418
C  -5.33819 -0.699579 -1.018278
H  1.091051 0.382205 2.160958
H  0.223118 2.546977 -1.428141
H  2.460557 2.007399 -2.298252
H  -0.759613 -0.572875 -0.349812
H  -5.117645 1.656927 0.345331
H  -2.78655 -1.62998 -1.163462
H  3.028883 -4.496186 1.439452
H  2.865798 -4.77316 -0.310441
H  4.420579 -4.22878 0.361373
elementType: Cl S F O N C H
totalener: -2296.04562964 hartree
nucrepener: 3048.31076406 hartree
electener: -5344.35639369 hartree
oneelecener: -9249.79970995 hartree
twoeener: 3905.44331625 hartree
cpcmener: -0.10362057 hartree
kineticenergy: 2289.28006091 hartree
xcener: -167.404304666472 hartree
chargesum: -1.0000000
charge: -0.070773 0.870740 -0.182663 -0.182115 -0.182579 -0.316074 -0.514348 -0.589132 -0.591009 -0.388554 -0.368780 -0.385585 0.552287 -0.041755 0.207331 0.041686 -0.150011 0.232196 0.264644 -0.118031 -0.134891 -0.055565 -0.012628 -0.142737 -0.114890 -0.176212 -0.253908 0.554781 0.139155 0.159832 0.156375 0.143163 0.128981 0.151399 0.122591 0.122721 0.124359
qa: -0.0708 0.8707 -0.1827 -0.1821 -0.1826 -0.3161 -0.5143 -0.5891 -0.5910 -0.3886 -0.3688 -0.3856 0.5523 -0.0418 0.2073 0.0417 -0.1500 0.2322 0.2646 -0.1180 -0.1349 -0.0556 -0.0126 -0.1427 -0.1149 -0.1762 -0.2539 0.5548 0.1392 0.1598 0.1564 0.1432 0.1290 0.1514 0.1226 0.1227 0.1244
va: 1.2449 5.7264 1.1041 1.1176 1.1185 2.0944 1.9659 1.8451 1.8412 1.8654 1.8734 2.6927 4.1105 3.7253 3.8153 3.7925 4.0751 4.5332 3.7969 4.0157 4.0834 3.6935 3.9498 3.8911 4.0507 4.0633 3.8920 4.4198 1.0124 0.9955 1.0165 1.0343 1.0289 1.0084 1.0136 1.0115 1.0134
dispersion: -0.021775980 hartree
energy: -2296.067405615655 hartree
dipole: 25.55811 -31.93483 -6.37672 -10.30108 11.48297 1.18189 0.24801 -1.77890 -1.53088
magnitude: 6.66356 au
magnitude: 16.93743 debye
