program: Orca
programVersion: 5.0.2
elementType: Cl S F F F O O O O O O N N C C C C C C C C C C C C C C C H H H H H H H H H
charge: -1
multiplicity: 1
keywords: wb97x-d3
keywords: def2-TZVPP
keywords: def2/J RIJCOSX
keywords: DEFGRID2
keywords: scfconv7
keywords: smallprint printgap noloewdin
keywords: NOSOSCF
formula: C15H9ClF3N2O6S
InChI: InChI=1/C15H9ClF3N2O6S/c1-28(25,26)20-14(22)10-7-9(3-4-12(10)21(23)24)27-13-5-2-8(6-11(13)16)15(17,18)19/h2-7H,1H3
37 atoms
Cl -2.751621 2.701515 -2.655269
S  2.859298 -2.473678 0.645784
F  -6.506667 -0.082806 -0.289519
F  -5.548495 -1.600103 0.894069
F  -5.770967 0.391217 1.670758
O  -0.514914 1.299559 -1.511769
O  4.580245 -0.263325 -1.80444
O  3.003139 -1.795781 1.945407
O  1.477117 -2.568446 0.145289
O  3.984666 1.317572 2.750919
O  5.052904 0.41739 1.13936
N  3.892146 -1.938473 -0.465449
N  4.055883 0.902417 1.617121
C  2.792399 0.267994 -0.395986
C  0.61202 1.213655 -0.738442
C  2.880107 1.008377 0.776519
C  1.63708 0.387999 -1.157979
C  3.848971 -0.686637 -0.914127
C  -1.686925 0.876395 -0.983914
C  0.715456 1.963606 0.426262
C  1.85975 1.856889 1.187231
C  -4.169048 0.073886 -0.01824
C  -2.856041 1.464704 -1.460115
C  -1.771894 -0.128367 -0.028445
C  -4.092135 1.067543 -0.984766
C  -3.006678 -0.522802 0.454256
C  3.453845 -4.134793 0.850265
C  -5.496584 -0.306831 0.557541
H  1.523578 -0.190471 -2.066144
H  -0.086656 2.622181 0.734568
H  1.951625 2.437395 2.093686
H  -0.877325 -0.620909 0.332537
H  -4.980577 1.548754 -1.370993
H  -3.041594 -1.306176 1.199425
H  4.485892 -4.119288 1.194426
H  2.828222 -4.628764 1.593764
H  3.386376 -4.670194 -0.094807
elementType: Cl S F O N C H
totalener: -2296.04536805 hartree
nucrepener: 3043.44534563 hartree
electener: -5339.49071368 hartree
oneelecener: -9239.95664269 hartree
twoeener: 3900.46592901 hartree
cpcmener: -0.10432827 hartree
kineticenergy: 2289.25503724 hartree
xcener: -167.399700225632 hartree
chargesum: -1.0000000
charge: -0.069617 0.872763 -0.182209 -0.181567 -0.182359 -0.315710 -0.516256 -0.591631 -0.590076 -0.391739 -0.368875 -0.387426 0.555390 -0.015726 0.221916 0.010892 -0.179247 0.237054 0.237309 -0.126714 -0.119451 -0.051854 -0.004995 -0.126422 -0.118862 -0.172310 -0.254330 0.554742 0.138827 0.163991 0.157151 0.147265 0.128888 0.151635 0.123935 0.122300 0.123318
qa: -0.0696 0.8728 -0.1822 -0.1816 -0.1824 -0.3157 -0.5163 -0.5916 -0.5901 -0.3917 -0.3689 -0.3874 0.5554 -0.0157 0.2219 0.0109 -0.1792 0.2371 0.2373 -0.1267 -0.1195 -0.0519 -0.0050 -0.1264 -0.1189 -0.1723 -0.2543 0.5547 0.1388 0.1640 0.1572 0.1473 0.1289 0.1516 0.1239 0.1223 0.1233
va: 1.2454 5.7235 1.1189 1.1186 1.1043 2.0938 1.9633 1.8408 1.8441 1.8648 1.8745 2.6898 4.1127 3.7359 3.8035 3.8226 4.0990 4.5286 3.8092 4.0017 4.0664 3.6902 3.9440 3.8850 4.0579 4.0529 3.8911 4.4195 1.0150 0.9930 1.0166 1.0252 1.0287 1.0079 1.0132 1.0115 1.0133
dispersion: -0.021731789 hartree
energy: -2296.067099839469 hartree
dipole: 25.40072 -32.14083 -6.74012 -10.72026 11.99999 1.27973 4.84543 -4.58437 0.26106
magnitude: 6.86549 au
magnitude: 17.45070 debye
