program: Orca
programVersion: 5.0.2
elementType: Cl S F F F O O O O O O N N C C C C C C C C C C C C C C C H H H H H H H H H
charge: -1
multiplicity: 1
keywords: wb97x-d3
keywords: def2-TZVPP
keywords: def2/J RIJCOSX
keywords: DEFGRID2
keywords: scfconv7
keywords: smallprint printgap noloewdin
keywords: NOSOSCF
formula: C15H9ClF3N2O6S
InChI: InChI=1/C15H9ClF3N2O6S/c1-28(25,26)20-14(22)10-7-9(3-4-12(10)21(23)24)27-13-5-2-8(6-11(13)16)15(17,18)19/h2-7H,1H3
37 atoms
Cl -2.722549 3.024036 -2.085722
S  3.268463 -2.496691 0.110181
F  -6.617586 0.60906 0.418424
F  -6.153742 -1.33244 -0.370486
F  -5.74025 -0.887954 1.690557
O  -0.601981 1.308896 -1.184999
O  4.574044 0.425461 -1.792626
O  3.447811 -2.164776 1.534064
O  1.866531 -2.612003 -0.323008
O  5.06309 0.482403 1.234857
O  3.935247 0.795335 3.017491
N  4.162492 -1.585484 -0.868935
N  4.024548 0.686091 1.816548
C  2.789063 0.380843 -0.28869
C  0.512999 1.140005 -0.415836
C  2.819186 0.827733 1.026989
C  1.613326 0.547673 -1.007112
C  3.939663 -0.282734 -1.016475
C  -1.803305 0.892438 -0.722522
C  0.554866 1.592664 0.897574
C  1.716832 1.429507 1.620595
C  -4.342614 0.095935 0.074895
C  -2.92512 1.620323 -1.107829
C  -1.961502 -0.241307 0.063791
C  -4.191603 1.223778 -0.719151
C  -3.225606 -0.63551 0.462336
C  4.034505 -4.074289 -0.163862
C  -5.711022 -0.373058 0.456251
H  1.546568 0.194873 -2.028602
H  -0.302281 2.074127 1.350118
H  1.761836 1.786801 2.639142
H  -1.099329 -0.829593 0.353319
H  -5.044724 1.808603 -1.035516
H  -3.322248 -1.524577 1.07104
H  3.519821 -4.812927 0.449695
H  3.947406 -4.347555 -1.213268
H  5.08329 -4.02987 0.12067
elementType: Cl S F O N C H
totalener: -2296.04590982 hartree
nucrepener: 3022.02929808 hartree
electener: -5318.07520789 hartree
oneelecener: -9196.95992284 hartree
twoeener: 3878.88471495 hartree
cpcmener: -0.10712597 hartree
kineticenergy: 2289.27232485 hartree
xcener: -167.403489302417 hartree
chargesum: -1.0000000
charge: -0.067293 0.866331 -0.181809 -0.181620 -0.181772 -0.311612 -0.515980 -0.589876 -0.590962 -0.369848 -0.391868 -0.384773 0.553825 -0.017065 0.234416 0.016376 -0.185171 0.230609 0.234800 -0.129417 -0.126365 -0.055479 -0.016485 -0.130939 -0.111482 -0.164177 -0.255709 0.555762 0.137011 0.164126 0.157523 0.156691 0.129492 0.153191 0.121586 0.123331 0.124632
qa: -0.0673 0.8663 -0.1818 -0.1816 -0.1818 -0.3116 -0.5160 -0.5899 -0.5910 -0.3698 -0.3919 -0.3848 0.5538 -0.0171 0.2344 0.0164 -0.1852 0.2306 0.2348 -0.1294 -0.1264 -0.0555 -0.0165 -0.1309 -0.1115 -0.1642 -0.2557 0.5558 0.1370 0.1641 0.1575 0.1567 0.1295 0.1532 0.1216 0.1233 0.1246
va: 1.2482 5.7342 1.1197 1.1062 1.1182 2.1000 1.9633 1.8428 1.8388 1.8733 1.8627 2.6885 4.1090 3.7270 3.7973 3.8205 4.1102 4.5358 3.8221 3.9769 4.0772 3.6954 3.9560 3.9053 4.0427 4.0368 3.8884 4.4186 1.0161 0.9922 1.0165 1.0094 1.0290 1.0070 1.0119 1.0135 1.0135
dispersion: -0.021311775 hartree
energy: -2296.067221593047 hartree
dipole: 26.78365 -34.01577 -7.23212 -11.56362 12.41326 0.84964 2.75532 -2.26571 0.48961
magnitude: 7.29829 au
magnitude: 18.55079 debye
