program: Orca
programVersion: 5.0.2
elementType: Cl S F F F O O O O O O N N C C C C C C C C C C C C C C C H H H H H H H H H
charge: -1
multiplicity: 1
keywords: wb97x-d3
keywords: def2-TZVPP
keywords: def2/J RIJCOSX
keywords: DEFGRID2
keywords: scfconv7
keywords: smallprint printgap noloewdin
keywords: NOSOSCF
formula: C15H9ClF3N2O6S
InChI: InChI=1/C15H9ClF3N2O6S/c1-28(25,26)20-14(22)10-7-9(3-4-12(10)21(23)24)27-13-5-2-8(6-11(13)16)15(17,18)19/h2-7H,1H3
37 atoms
Cl -3.090929 3.241045 1.499232
S  2.823317 -2.483582 0.225366
F  -5.500119 -0.367547 -2.346774
F  -5.282128 -2.023674 -0.998732
F  -6.434883 -0.305412 -0.412305
O  -0.684462 1.767788 0.969816
O  4.158629 0.150824 2.490123
O  1.363046 -2.415195 0.409286
O  3.292103 -2.106176 -1.120653
O  4.479899 0.765399 -2.32118
O  5.192335 0.225597 -0.385081
N  3.638191 -1.747044 1.402646
N  4.321369 0.604368 -1.133381
C  2.68766 0.416451 0.692822
C  0.547003 1.470823 0.4410
C  3.018545 0.892825 -0.570232
C  1.431382 0.72599 1.197206
C  3.578698 -0.430371 1.572872
C  -1.769861 1.136988 0.457613
C  0.885977 1.943213 -0.818889
C  2.135512 1.653538 -1.325222
C  -4.092091 -0.06126 -0.491038
C  -3.009327 1.740885 0.65523
C  -1.703402 -0.076859 -0.212734
C  -4.166917 1.148926 0.185446
C  -2.859431 -0.669729 -0.687311
C  3.309222 -4.164934 0.499701
C  -5.326958 -0.68785 -1.055314
H  1.132066 0.361933 2.171741
H  0.186652 2.536489 -1.393002
H  2.414889 2.028657 -2.298885
H  -0.754526 -0.576558 -0.357726
H  -5.113223 1.646038 0.350536
H  -2.777522 -1.615133 -1.205929
H  3.011304 -4.477178 1.498081
H  2.806567 -4.785268 -0.241582
H  4.386543 -4.261734 0.386788
elementType: Cl S F O N C H
totalener: -2296.05070329 hartree
nucrepener: 3047.62461390 hartree
electener: -5343.67531719 hartree
oneelecener: -9248.56666717 hartree
twoeener: 3904.89134998 hartree
cpcmener: -0.12209246 hartree
kineticenergy: 2289.26637931 hartree
xcener: -167.404885858941 hartree
chargesum: -1.0000000
charge: -0.070346 0.884439 -0.183111 -0.182846 -0.182078 -0.323394 -0.552226 -0.599626 -0.606059 -0.396081 -0.383166 -0.389080 0.566458 -0.042440 0.218753 0.029572 -0.161759 0.256182 0.269971 -0.116375 -0.124290 -0.054162 -0.013907 -0.144161 -0.111796 -0.177542 -0.245242 0.556669 0.143366 0.166059 0.161516 0.141968 0.131351 0.153249 0.125957 0.127188 0.126992
qa: -0.0703 0.8844 -0.1831 -0.1828 -0.1821 -0.3234 -0.5522 -0.5996 -0.6061 -0.3961 -0.3832 -0.3891 0.5665 -0.0424 0.2188 0.0296 -0.1618 0.2562 0.2700 -0.1164 -0.1243 -0.0542 -0.0139 -0.1442 -0.1118 -0.1775 -0.2452 0.5567 0.1434 0.1661 0.1615 0.1420 0.1314 0.1532 0.1260 0.1272 0.1270
va: 1.2450 5.6974 1.1040 1.1165 1.1195 2.0873 1.9134 1.8328 1.8247 1.8570 1.8574 2.6999 4.0863 3.7195 3.8077 3.8018 4.0805 4.4982 3.7812 4.0170 4.0703 3.6910 3.9542 3.8894 4.0470 4.0647 3.8893 4.4176 1.0120 0.9933 1.0141 1.0332 1.0276 1.0079 1.0128 1.0108 1.0126
dispersion: -0.021784224 hartree
energy: -2296.072487517052 hartree
dipole: 25.37805 -32.11775 -6.73970 -10.32277 11.44320 1.12042 0.45413 -2.03624 -1.58211
magnitude: 7.01299 au
magnitude: 17.82561 debye
