program: Orca
programVersion: 5.0.2
elementType: Cl S F F F O O O O O O N N C C C C C C C C C C C C C C C H H H H H H H H H
charge: -1
multiplicity: 1
keywords: wb97x-d3
keywords: def2-TZVPP
keywords: def2/J RIJCOSX
keywords: DEFGRID2
keywords: scfconv7
keywords: smallprint printgap noloewdin
keywords: NOSOSCF
formula: C15H9ClF3N2O6S
InChI: InChI=1/C15H9ClF3N2O6S/c1-28(25,26)20-14(22)10-7-9(3-4-12(10)21(23)24)27-13-5-2-8(6-11(13)16)15(17,18)19/h2-7H,1H3
37 atoms
Cl -2.324868 0.360381 -3.177791
S  3.197684 -2.168782 -0.493944
F  -6.027462 0.496139 1.725919
F  -6.243743 -0.83526 0.050873
F  -5.082677 -1.429734 1.761995
O  -0.659102 1.721508 -1.251023
O  1.972733 -0.775601 2.731521
O  2.014546 -2.249322 -1.367516
O  4.216418 -1.197793 -0.931467
O  5.233723 1.994723 0.596123
O  4.607083 0.361891 1.81411
N  2.798519 -2.032233 1.059761
N  4.390023 1.219557 0.987902
C  2.123038 0.317833 0.678198
C  0.552133 1.559523 -0.653674
C  3.059503 1.319643 0.437903
C  0.864304 0.444131 0.112116
C  2.338233 -0.892075 1.560592
C  -1.781667 1.205452 -0.681392
C  1.494852 2.551955 -0.8893
C  2.754874 2.423863 -0.347769
C  -4.140814 0.191925 0.359308
C  -2.684437 0.545679 -1.5047
C  -2.070524 1.370269 0.666403
C  -3.868373 0.041851 -0.990712
C  -3.242802 0.85925 1.186435
C  3.9586 -3.770511 -0.483952
C  -5.377361 -0.39258 0.96516
H  0.13441 -0.339237 0.271956
H  1.24264 3.414511 -1.490851
H  3.487653 3.195961 -0.530187
H  -1.380042 1.899917 1.309885
H  -4.552544 -0.470056 -1.653091
H  -3.447112 0.991937 2.240625
H  4.827796 -3.762373 0.169645
H  3.244602 -4.51521 -0.140041
H  4.268871 -4.004344 -1.501352
elementType: Cl S F O N C H
totalener: -2296.05173311 hartree
nucrepener: 3053.17542552 hartree
electener: -5349.22715863 hartree
oneelecener: -9260.29698124 hartree
twoeener: 3911.06982261 hartree
cpcmener: -0.12938763 hartree
kineticenergy: 2289.26827915 hartree
xcener: -167.407462928622 hartree
chargesum: -1.0000000
charge: -0.063684 0.885135 -0.183160 -0.179793 -0.182282 -0.310432 -0.554391 -0.607347 -0.603879 -0.405623 -0.392261 -0.390761 0.573662 -0.023829 0.295878 -0.039502 -0.141905 0.261609 0.249998 -0.240535 -0.064760 -0.061132 -0.020667 -0.157179 -0.103159 -0.149525 -0.248555 0.560801 0.147601 0.155339 0.160865 0.166612 0.133530 0.154785 0.126426 0.126285 0.125835
qa: -0.0637 0.8851 -0.1832 -0.1798 -0.1823 -0.3104 -0.5544 -0.6073 -0.6039 -0.4056 -0.3923 -0.3908 0.5737 -0.0238 0.2959 -0.0395 -0.1419 0.2616 0.2500 -0.2405 -0.0648 -0.0611 -0.0207 -0.1572 -0.1032 -0.1495 -0.2486 0.5608 0.1476 0.1553 0.1609 0.1666 0.1335 0.1548 0.1264 0.1263 0.1258
va: 1.2516 5.7150 1.1157 1.1245 1.1094 2.1205 1.9122 1.8239 1.8239 1.8505 1.8513 2.6990 4.0884 3.7633 3.7677 3.8716 3.9564 4.4912 3.8050 4.0759 4.0298 3.7054 3.9829 3.9450 4.0073 4.0216 3.8824 4.4160 1.0105 1.0040 1.0138 0.9908 1.0263 1.0057 1.0126 1.0133 1.0111
dispersion: -0.021211811 hartree
energy: -2296.072944920047 hartree
dipole: 26.69759 -32.35992 -5.66232 -2.01242 4.25688 2.24446 -0.17116 -1.79529 -1.96645
magnitude: 6.40050 au
magnitude: 16.26878 debye
