program: Orca
programVersion: 5.0.2
elementType: Cl S F F F O O O O O O N N C C C C C C C C C C C C C C C H H H H H H H H H
charge: -1
multiplicity: 1
keywords: wb97x-d3
keywords: def2-TZVPP
keywords: def2/J RIJCOSX
keywords: DEFGRID2
keywords: scfconv7
keywords: smallprint printgap noloewdin
keywords: NOSOSCF
formula: C15H9ClF3N2O6S
InChI: InChI=1/C15H9ClF3N2O6S/c1-28(25,26)20-14(22)10-7-9(3-4-12(10)21(23)24)27-13-5-2-8(6-11(13)16)15(17,18)19/h2-7H,1H3
37 atoms
Cl -2.843838 3.33284 0.920986
S  2.004683 -2.305682 -0.019766
F  -4.916894 -1.812323 0.986488
F  -5.933131 -0.732734 -0.565763
F  -4.629669 -2.36695 -1.069601
O  -0.494526 2.335005 -0.399543
O  3.484007 -0.099076 2.607358
O  0.552417 -2.486493 0.135394
O  2.410388 -1.576938 -1.235034
O  5.662693 1.696836 -0.673629
O  5.153539 -0.207347 0.142464
N  2.653543 -1.766781 1.348504
N  4.85709 0.899572 -0.247953
C  2.56313 0.572929 0.571201
C  0.811055 1.954786 -0.317681
C  3.465225 1.282632 -0.216158
C  1.228984 0.941048 0.534148
C  2.9557 -0.493887 1.565737
C  -1.484107 1.403759 -0.377686
C  1.718101 2.656806 -1.098309
C  3.054895 2.323504 -1.036664
C  -3.621265 -0.367076 -0.336384
C  -2.690461 1.770268 0.213362
C  -1.359374 0.150824 -0.957743
C  -3.758451 0.894317 0.230577
C  -2.421361 -0.736587 -0.926951
C  2.721319 -3.925906 -0.117358
C  -4.771441 -1.320384 -0.253126
H  0.516298 0.426132 1.16636
H  1.380387 3.445366 -1.756571
H  3.761771 2.853433 -1.658512
H  -0.432629 -0.145235 -1.431428
H  -4.685093 1.203971 0.695677
H  -2.293391 -1.709453 -1.379764
H  2.456985 -4.499656 0.767782
H  2.325783 -4.419293 -1.004091
H  3.80298 -3.844379 -0.195063
elementType: Cl S F O N C H
totalener: -2296.05155471 hartree
nucrepener: 3095.82142213 hartree
electener: -5391.87297685 hartree
oneelecener: -9345.60535402 hartree
twoeener: 3953.73237717 hartree
cpcmener: -0.11916256 hartree
kineticenergy: 2289.26085821 hartree
xcener: -167.407426792935 hartree
chargesum: -1.0000000
charge: -0.066139 0.886111 -0.183276 -0.184222 -0.179999 -0.314588 -0.549796 -0.612653 -0.600826 -0.404872 -0.388934 -0.405022 0.569977 -0.052689 0.298507 0.004772 -0.149538 0.266268 0.279500 -0.236107 -0.062443 -0.065872 -0.032759 -0.170566 -0.122835 -0.125354 -0.246569 0.560305 0.156008 0.155180 0.160056 0.151514 0.132040 0.154667 0.126426 0.128323 0.125403
qa: -0.0661 0.8861 -0.1833 -0.1842 -0.1800 -0.3146 -0.5498 -0.6127 -0.6008 -0.4049 -0.3889 -0.4050 0.5700 -0.0527 0.2985 0.0048 -0.1495 0.2663 0.2795 -0.2361 -0.0624 -0.0659 -0.0328 -0.1706 -0.1228 -0.1254 -0.2466 0.5603 0.1560 0.1552 0.1601 0.1515 0.1320 0.1547 0.1264 0.1283 0.1254
va: 1.2489 5.6900 1.1069 1.1150 1.1235 2.1213 1.9141 1.8229 1.8149 1.8503 1.8607 2.7156 4.0740 3.7075 3.7668 3.8104 3.9715 4.4715 3.7935 4.0828 4.0133 3.7198 3.9709 3.9253 4.0685 3.9613 3.9043 4.4183 1.0106 1.0038 1.0119 1.0217 1.0271 1.0127 1.0131 1.0102 1.0115
dispersion: -0.022575905 hartree
energy: -2296.074130619832 hartree
dipole: 24.49380 -29.50427 -5.01047 -6.26109 7.87625 1.61516 -5.21122 2.41361 -2.79762
magnitude: 5.96156 au
magnitude: 15.15308 debye
