program: Orca
programVersion: 5.0.2
elementType: Cl S F F F O O O O O O N N C C C C C C C C C C C C C C C H H H H H H H H H
charge: -1
multiplicity: 1
keywords: wb97x-d3
keywords: def2-TZVPP
keywords: def2/J RIJCOSX
keywords: DEFGRID2
keywords: scfconv7
keywords: smallprint printgap noloewdin
keywords: NOSOSCF
formula: C15H9ClF3N2O6S
InChI: InChI=1/C15H9ClF3N2O6S/c1-28(25,26)20-14(22)10-7-9(3-4-12(10)21(23)24)27-13-5-2-8(6-11(13)16)15(17,18)19/h2-7H,1H3
37 atoms
Cl -2.839655 3.491539 0.558673
S  2.14317 -2.408513 0.093646
F  -4.639534 -2.426299 0.159514
F  -5.877189 -0.738499 0.647697
F  -5.551402 -1.275673 -1.407847
O  -0.513645 2.250728 -0.552056
O  3.3499 -0.005774 2.687909
O  0.758458 -2.888951 0.209208
O  2.420809 -1.603735 -1.109392
O  5.643169 1.586792 -0.656188
O  5.110809 -0.264565 0.26163
N  2.60837 -1.75559 1.485167
N  4.826029 0.819066 -0.197743
C  2.516678 0.539175 0.582644
C  0.784162 1.864712 -0.418192
C  3.436052 1.204917 -0.220632
C  1.183329 0.902939 0.499057
C  2.884949 -0.46926 1.644696
C  -1.533563 1.361448 -0.445219
C  1.708295 2.518496 -1.222238
C  3.043058 2.192564 -1.113221
C  -3.752776 -0.293257 -0.265009
C  -2.738289 1.849249 0.051202
C  -1.44663 0.038241 -0.857622
C  -3.850405 1.03147 0.132899
C  -2.551806 -0.786965 -0.760631
C  3.196719 -3.833623 0.007332
C  -4.954225 -1.181397 -0.210664
H  0.45933 0.417807 1.142001
H  1.383062 3.265303 -1.933449
H  3.76241 2.686648 -1.750217
H  -0.520703 -0.356768 -1.254911
H  -4.776122 1.439446 0.515097
H  -2.459036 -1.814981 -1.084535
H  4.233586 -3.508255 -0.046267
H  3.051034 -4.459462 0.884949
H  2.943924 -4.397657 -0.889908
elementType: Cl S F O N C H
totalener: -2296.05093280 hartree
nucrepener: 3079.19395652 hartree
electener: -5375.24488932 hartree
oneelecener: -9311.98528750 hartree
twoeener: 3936.74039818 hartree
cpcmener: -0.11818774 hartree
kineticenergy: 2289.27530639 hartree
xcener: -167.410931661649 hartree
chargesum: -1.0000000
charge: -0.065943 0.877756 -0.181721 -0.181379 -0.182640 -0.309828 -0.548982 -0.615133 -0.598128 -0.407208 -0.390844 -0.413507 0.572467 -0.029484 0.321262 -0.004791 -0.179894 0.277513 0.285110 -0.244441 -0.060712 -0.062638 -0.039816 -0.173049 -0.097863 -0.139266 -0.241362 0.555950 0.157264 0.154217 0.160161 0.149011 0.130248 0.151070 0.123542 0.125397 0.127656
qa: -0.0659 0.8778 -0.1817 -0.1814 -0.1826 -0.3098 -0.5490 -0.6151 -0.5981 -0.4072 -0.3908 -0.4135 0.5725 -0.0295 0.3213 -0.0048 -0.1799 0.2775 0.2851 -0.2444 -0.0607 -0.0626 -0.0398 -0.1730 -0.0979 -0.1393 -0.2414 0.5560 0.1573 0.1542 0.1602 0.1490 0.1302 0.1511 0.1235 0.1254 0.1277
va: 1.2500 5.7124 1.1182 1.1209 1.1055 2.1249 1.9139 1.8245 1.8146 1.8475 1.8566 2.7164 4.0651 3.6999 3.7468 3.8238 3.9885 4.4571 3.7995 4.0815 4.0135 3.7132 3.9747 3.9388 4.0192 4.0168 3.9055 4.4179 1.0052 1.0048 1.0121 1.0217 1.0281 1.0113 1.0112 1.0131 1.0109
dispersion: -0.022211571 hartree
energy: -2296.073144372105 hartree
dipole: 26.31916 -31.08585 -4.76669 -6.94202 8.73278 1.79076 -4.39352 1.46325 -2.93027
magnitude: 5.87492 au
magnitude: 14.93285 debye
