program: Orca
programVersion: 5.0.2
elementType: Cl S F F F F O O O O O N N N N C C C C C C C C C C C C C C C C C H H H H H H H H H H H H H H H H
charge: -1
multiplicity: 1
keywords: wb97x-d3
keywords: def2-TZVPP
keywords: def2/J RIJCOSX
keywords: DEFGRID2
keywords: scfconv7
keywords: smallprint printgap noloewdin
keywords: NOSOSCF
formula: C17H16ClF4N4O5S
InChI: InChI=1/C17H16ClF4N4O5S/c1-8(2)25(4)32(30,31)23-15(28)9-5-12(11(19)6-10(9)18)26-14(27)7-13(17(20,21)22)24(3)16(26)29/h5-8H,1-4H3
48 atoms
Cl -3.136154 -2.168231 -1.700557
S  -4.552527 1.798523 -0.785868
F  1.803399 -2.881772 -1.691594
F  6.822319 1.520858 -0.321047
F  6.087054 1.765016 1.679514
F  7.051982 -0.07134 1.089837
O  -5.537042 1.586862 -1.83572
O  -4.102076 3.161677 -0.544769
O  -2.181504 1.147258 0.869119
O  2.254943 -1.590386 1.572406
O  2.644113 0.378284 -2.492134
N  -5.306866 1.301688 0.634311
N  -3.353154 0.753586 -1.101086
N  2.388178 -0.509011 -0.412093
N  4.146117 -0.396482 1.160427
C  -5.8734 -0.038362 0.637666
C  -7.373202 0.022232 0.915442
C  -5.166986 -0.991407 1.599623
C  -5.015174 1.935749 1.894555
C  1.047147 -0.889605 -0.712359
C  -1.328317 -0.391107 -0.67331
C  -2.379964 0.607128 -0.217622
C  -0.009631 -0.076383 -0.361109
C  2.879821 -0.889732 0.822244
C  4.872592 0.340658 0.256476
C  3.102736 0.171416 -1.399244
C  0.785285 -2.077658 -1.365561
C  4.418005 0.617088 -0.972171
C  -1.552181 -1.59969 -1.327532
C  -0.502951 -2.448554 -1.668278
C  4.649603 -0.78329 2.474553
C  6.217739 0.887955 0.679188
H  -5.745317 -0.444351 -0.366867
H  -7.820689 -0.973845 0.877186
H  -7.581328 0.43574 1.905098
H  -7.86264 0.649938 0.172025
H  -4.091052 -0.997819 1.432705
H  -5.536497 -2.008287 1.455055
H  -5.344868 -0.725417 2.64378
H  -4.645666 2.939701 1.712454
H  -4.263696 1.409726 2.486884
H  -5.932986 2.021532 2.485864
H  0.176757 0.841952 0.180188
H  4.986829 1.196717 -1.679862
H  -0.692402 -3.391569 -2.161494
H  5.066507 0.067989 3.003095
H  5.395941 -1.572579 2.401083
H  3.814411 -1.159687 3.052315
totalener: -2510.66170959 hartree
nucrepener: 3821.01618462 hartree
electener: -6331.67789421 hartree
twoeener: 4754.25905594 hartree
kineticenergy: 2502.94315049 hartree
xcener: -187.576037915604 hartree
chargesum: -1.0000000
charge: -0.064641 0.849182 -0.218660 -0.158396 -0.162496 -0.165432 -0.523777 -0.513831 -0.473532 -0.369279 -0.340282 -0.188147 -0.395873 -0.117060 -0.131993 0.086562 -0.257796 -0.278211 -0.191099 0.071269 0.094492 0.156856 -0.084748 0.354738 -0.022218 0.288205 0.225403 -0.166690 0.115075 -0.204707 -0.213806 0.536747 0.055741 0.058632 0.054842 0.099830 0.110351 0.071091 0.066070 0.112007 0.085886 0.066449 0.101759 0.126451 0.091962 0.118249 0.118631 0.126192
qa: -0.0646 0.8492 -0.2187 -0.1584 -0.1625 -0.1654 -0.5238 -0.5138 -0.4735 -0.3693 -0.3403 -0.1881 -0.3959 -0.1171 -0.1320 0.0866 -0.2578 -0.2782 -0.1911 0.0713 0.0945 0.1569 -0.0847 0.3547 -0.0222 0.2882 0.2254 -0.1667 0.1151 -0.2047 -0.2138 0.5367 0.0557 0.0586 0.0548 0.0998 0.1104 0.0711 0.0661 0.1120 0.0859 0.0664 0.1018 0.1265 0.0920 0.1182 0.1186 0.1262
va: 1.2403 6.0751 1.0722 1.1502 1.1420 1.1396 1.9678 1.9756 2.0129 2.1459 2.1724 2.9213 2.6919 3.1116 3.2991 3.9427 3.9185 3.9190 3.9622 3.4247 3.7271 4.3847 4.1347 4.2688 3.9445 4.2851 4.1554 3.8423 3.8640 4.0752 3.8644 4.4155 1.0401 1.0071 1.0068 1.0218 1.0118 1.0075 1.0016 1.0331 0.9959 0.9784 1.0552 1.0271 1.0361 1.0030 0.9898 1.0276
dispersion: -0.029078031 hartree
energy: -2510.690787616624 hartree
dipole: -52.74865 59.06577 6.31712 0.83785 -3.13025 -2.29240 21.54884 -19.50872 2.04012
magnitude: 7.02305 au
magnitude: 17.85117 debye
