program: Orca
programVersion: 5.0.2
elementType: Cl S F F F F O O O O O N N N N C C C C C C C C C C C C C C C C C H H H H H H H H H H H H H H H H
charge: -1
multiplicity: 1
keywords: wb97x-d3
keywords: def2-TZVPP
keywords: def2/J RIJCOSX
keywords: DEFGRID2
keywords: scfconv7
keywords: smallprint printgap noloewdin
keywords: NOSOSCF
formula: C17H16ClF4N4O5S
InChI: InChI=1/C17H16ClF4N4O5S/c1-8(2)25(4)32(30,31)23-15(28)9-5-12(11(19)6-10(9)18)26-14(27)7-13(17(20,21)22)24(3)16(26)29/h5-8H,1-4H3
48 atoms
Cl -2.721397 -3.626386 -1.579588
S  -3.753212 0.907982 1.659976
F  2.165174 -2.733928 -1.914279
F  6.733283 0.957471 0.114668
F  5.74222 2.822895 -0.25991
F  5.764797 2.01858 1.724314
O  -3.131295 2.051826 2.31115
O  -4.607448 0.048391 2.466469
O  -3.847319 -1.315663 -0.323518
O  2.660016 -1.91454 1.202915
O  1.62554 1.03647 -2.0865
N  -4.753191 1.559487 0.475522
N  -2.53875 0.124764 0.938775
N  2.113279 -0.430998 -0.416659
N  4.10004 -0.194039 0.838915
C  -4.14194 2.471167 -0.479547
C  -4.818684 3.838562 -0.417649
C  -4.123888 1.924327 -1.905756
C  -5.99421 0.917794 0.119216
C  0.923618 -1.170751 -0.679996
C  -1.479675 -1.446802 -0.4508
C  -2.784294 -0.868965 0.088047
C  -0.296816 -0.75306 -0.198444
C  2.931429 -0.9205 0.584061
C  4.38082 0.948627 0.13008
C  2.363782 0.696972 -1.199152
C  0.983426 -2.324801 -1.437566
C  3.58118 1.404183 -0.842153
C  -1.37497 -2.613179 -1.20696
C  -0.148753 -3.056523 -1.697597
C  4.929488 -0.68707 1.934043
C  5.660945 1.69269 0.4340
H  -3.104229 2.610236 -0.172284
H  -4.75775 4.238465 0.593562
H  -4.339578 4.544258 -1.100176
H  -5.872553 3.777253 -0.69931
H  -5.126463 1.878439 -2.336643
H  -3.699074 0.922736 -1.941481
H  -3.523371 2.571803 -2.547367
H  -6.737533 1.680176 -0.135168
H  -6.370201 0.365359 0.974446
H  -5.905425 0.21954 -0.715178
H  -0.377329 0.141603 0.405321
H  3.806322 2.295693 -1.403422
H  -0.084365 -3.965628 -2.278675
H  4.806677 -0.081544 2.830064
H  5.97727 -0.71918 1.652595
H  4.61054 -1.69645 2.162201
totalener: -2510.66350678 hartree
nucrepener: 3845.42232306 hartree
electener: -6356.08582985 hartree
twoeener: 4778.94767919 hartree
kineticenergy: 2502.94887451 hartree
xcener: -187.580903005500 hartree
chargesum: -1.0000000
charge: -0.058396 0.837218 -0.219480 -0.166352 -0.158068 -0.162548 -0.528755 -0.515752 -0.455903 -0.373517 -0.340377 -0.191801 -0.407238 -0.115715 -0.131049 0.077416 -0.255406 -0.268680 -0.191070 0.065190 0.071863 0.180997 -0.082166 0.362798 -0.022725 0.282516 0.214955 -0.165391 0.101068 -0.190676 -0.211514 0.536942 0.055688 0.098466 0.059933 0.054201 0.060780 0.115146 0.070849 0.065514 0.110636 0.090437 0.125536 0.125478 0.086961 0.123460 0.114608 0.123920
qa: -0.0584 0.8372 -0.2195 -0.1664 -0.1581 -0.1625 -0.5288 -0.5158 -0.4559 -0.3735 -0.3404 -0.1918 -0.4072 -0.1157 -0.1310 0.0774 -0.2554 -0.2687 -0.1911 0.0652 0.0719 0.1810 -0.0822 0.3628 -0.0227 0.2825 0.2150 -0.1654 0.1011 -0.1907 -0.2115 0.5369 0.0557 0.0985 0.0599 0.0542 0.0608 0.1151 0.0708 0.0655 0.1106 0.0904 0.1255 0.1255 0.0870 0.1235 0.1146 0.1239
va: 1.2550 6.0876 1.0728 1.1355 1.1506 1.1444 1.9615 1.9763 2.0090 2.1434 2.1729 2.9169 2.7032 3.1189 3.3023 3.9571 3.9118 3.9143 3.9581 3.4766 3.6180 4.4233 4.1308 4.2597 3.9481 4.2937 4.1527 3.8410 3.8907 4.0634 3.8602 4.4146 1.0374 1.0221 1.0072 1.0074 0.9991 1.0153 1.0074 0.9785 1.0320 0.9964 1.0699 1.0276 1.0414 0.9905 1.0020 1.0295
dispersion: -0.028198435 hartree
energy: -2510.691705219524 hartree
dipole: -44.36130 50.48392 6.12262 19.79419 -19.52639 0.26780 -1.61661 0.06521 -1.55140
magnitude: 6.32179 au
magnitude: 16.06871 debye
